MinimumAdvertisedPrice
type: PriceTypeEnumeration
isPartOf: pending.schema.org
comment: Represents the minimum advertised price ("MAP") (as dictated by the manufacturer) of an offered product.
source: https://github.com/schemaorg/schemaorg/issues/2712

RightHandDriving
type: SteeringPositionValue
comment: The steering position is on the right side of the vehicle (viewed from the main direction of driving).
contributor: Automotive Ontology Working Group

validThrough
type: Property
domainIncludes: LocationFeatureSpecification
domainIncludes: PriceSpecification
domainIncludes: Offer
domainIncludes: OpeningHoursSpecification
domainIncludes: MonetaryAmount
domainIncludes: JobPosting
domainIncludes: Demand
domainIncludes: FinancialIncentive
comment: The date after when the item is not valid. For example the end of an offer, salary period, or a period of opening hours.
contributor: GoodRelationsTerms
equivalent property: hasEndDate
rangeIncludes: DateTime
rangeIncludes: Date

eventStatus
type: Property
domainIncludes: Event
comment: An eventStatus of an event represents its status; particularly useful when an event is cancelled or rescheduled.
rangeIncludes: EventStatusType

employmentUnit
type: Property
comment: Indicates the department, unit and/or facility where the employee reports and/or in which the job is to be performed.
source: https://github.com/schemaorg/schemaorg/issues/2296
isPartOf: pending.schema.org
rangeIncludes: Organization
domainIncludes: JobPosting

datePosted
type: Property
source: https://github.com/schemaorg/schemaorg/issues/2490
source: https://github.com/schemaorg/schemaorg/issues/2521
rangeIncludes: DateTime
rangeIncludes: Date
domainIncludes: RealEstateListing
domainIncludes: SpecialAnnouncement
domainIncludes: JobPosting
domainIncludes: CDCPMDRecord
comment: Publication date of an online listing.

Play
type: Class
source: https://github.com/schemaorg/schemaorg/issues/1816
subclass of: CreativeWork
comment: A play is a form of literature, usually consisting of dialogue between characters, intended for theatrical performance rather than just reading. Note: A performance of a Play would be a TheaterEvent or BroadcastEvent - the *Play* being the workPerformed.
isPartOf: pending.schema.org

tissueSample
type: Property
domainIncludes: PathologyTest
rangeIncludes: Text
isPartOf: health-lifesci.schema.org
comment: The type of tissue sample required for the test.

WearableSizeSystemAU
type: WearableSizeSystemEnumeration
source: https://github.com/schemaorg/schemaorg/issues/2811
isPartOf: pending.schema.org
comment: Australian size system for wearables.

SkiResort
type: Class
subclass of: SportsActivityLocation
subclass of: Resort
comment: A ski resort.

Virus
type: InfectiousAgentClass
isPartOf: health-lifesci.schema.org
comment: Pathogenic virus that causes viral infection.

MixedEventAttendanceMode
type: EventAttendanceModeEnumeration
source: https://github.com/schemaorg/schemaorg/issues/1842
isPartOf: pending.schema.org
comment: MixedEventAttendanceMode - an event that is conducted as a combination of both offline and online modes.

hasAdultConsideration
type: Property
domainIncludes: Product
domainIncludes: Offer
rangeIncludes: AdultOrientedEnumeration
source: https://github.com/schemaorg/schemaorg/issues/2989
isPartOf: pending.schema.org
comment: Used to tag an item to be intended or suitable for consumption or use by adults only.

accessibilityControl
type: Property
comment: Identifies input methods that are sufficient to fully control the described resource. Values should be drawn from the [approved vocabulary](https://www.w3.org/2021/a11y-discov-vocab/latest/#accessibilityControl-vocabulary).
rangeIncludes: Text
domainIncludes: CreativeWork

significantLinks
type: Property
supersededBy: significantLink
rangeIncludes: URL
domainIncludes: WebPage
comment: The most significant URLs on the page. Typically, these are the non-navigation links that are clicked on the most.

significantLink
type: Property
rangeIncludes: URL
comment: One of the more significant URLs on the page. Typically, these are the non-navigation links that are clicked on the most.
domainIncludes: WebPage

isbn
type: Property
sub property of: identifier
domainIncludes: Book
equivalent property: isbn
rangeIncludes: Text
comment: The ISBN of the book.

identifier
type: Property
rangeIncludes: URL
rangeIncludes: PropertyValue
rangeIncludes: Text
domainIncludes: Thing
equivalent property: identifiedBy
equivalent property: identifier
comment: The identifier property represents any kind of identifier for any kind of Thing, such as ISBNs, GTIN codes, UUIDs etc. Schema.org provides dedicated properties for representing many of these, either as textual strings or as URL (URI) links. See [background notes](/docs/datamodel.html#identifierBg) for more details.

tourBookingPage
type: Property
isPartOf: pending.schema.org
rangeIncludes: URL
domainIncludes: Accommodation
domainIncludes: Place
domainIncludes: ApartmentComplex
source: https://github.com/schemaorg/schemaorg/issues/2373
comment: A page providing information on how to book a tour of some Place, such as an Accommodation or ApartmentComplex in a real estate setting, as well as other kinds of tours as appropriate.

ReadPermission
type: DigitalDocumentPermissionType
comment: Permission to read or view the document.

Canal
type: Class
comment: A canal, like the Panama Canal.
subclass of: BodyOfWater

amountOfThisGood
type: Property
rangeIncludes: Number
contributor: GoodRelationsTerms
domainIncludes: TypeAndQuantityNode
comment: The quantity of the goods included in the offer.

ReservationHold
type: ReservationStatusType
comment: The status of a reservation on hold pending an update like credit card number or flight changes.

mediaItemAppearance
type: Property
rangeIncludes: MediaObject
source: https://github.com/schemaorg/schemaorg/issues/2450
domainIncludes: MediaReviewItem
comment: In the context of a MediaReview, indicates specific media item(s) that are grouped using a MediaReviewItem.
isPartOf: pending.schema.org

aggregateRating
type: Property
domainIncludes: Service
domainIncludes: Offer
domainIncludes: Organization
domainIncludes: Brand
domainIncludes: Product
domainIncludes: Event
domainIncludes: Place
domainIncludes: CreativeWork
rangeIncludes: AggregateRating
comment: The overall rating, based on a collection of reviews or ratings, of the item.

sugarContent
type: Property
rangeIncludes: Mass
comment: The number of grams of sugar.
domainIncludes: NutritionInformation

nerveMotor
type: Property
rangeIncludes: Muscle
comment: The neurological pathway extension that involves muscle control.
isPartOf: health-lifesci.schema.org
domainIncludes: Nerve

creativeWorkStatus
type: Property
rangeIncludes: DefinedTerm
rangeIncludes: Text
source: https://github.com/schemaorg/schemaorg/issues/987
domainIncludes: CreativeWork
isPartOf: pending.schema.org
comment: The status of a creative work in terms of its stage in a lifecycle. Example terms include Incomplete, Draft, Published, Obsolete. Some organizations define a set of terms for the stages of their publication lifecycle.

datePublished
type: Property
comment: Date of first publication or broadcast. For example the date a CreativeWork was broadcast or a Certification was issued.
rangeIncludes: Date
rangeIncludes: DateTime
domainIncludes: Certification
domainIncludes: CreativeWork

PaymentDeclined
type: PaymentStatusType
comment: The payee received the payment, but it was declined for some reason.

addressCountry
type: Property
rangeIncludes: Country
rangeIncludes: Text
domainIncludes: PostalAddress
domainIncludes: DefinedRegion
domainIncludes: GeoShape
domainIncludes: GeoCoordinates
comment: The country. Recommended to be in 2-letter [ISO 3166-1 alpha-2](http://en.wikipedia.org/wiki/ISO_3166-1) format, for example "US". For backward compatibility, a 3-letter [ISO 3166-1 alpha-3](https://en.wikipedia.org/wiki/ISO_3166-1_alpha-3) country code such as "SGP" or a full country name such as "Singapore" can also be used.
source: https://github.com/schemaorg/schemaorg/issues/2506

PlaceboControlledTrial
type: MedicalTrialDesign
isPartOf: health-lifesci.schema.org
comment: A placebo-controlled trial design.

RsvpResponseMaybe
type: RsvpResponseType
comment: The invitee may or may not attend.

includesHealthPlanFormulary
type: Property
source: https://github.com/schemaorg/schemaorg/issues/1062
comment: Formularies covered by this plan.
rangeIncludes: HealthPlanFormulary
domainIncludes: HealthInsurancePlan
isPartOf: pending.schema.org

EventSeries
type: Class
subclass of: Event
subclass of: Series
isPartOf: pending.schema.org
source: https://github.com/schemaorg/schemaorg/issues/447
comment: A series of Events. Included events can relate with the series using the superEvent property. An EventSeries is a collection of events that share some unifying characteristic. For example, "The Olympic Games" is a series, which is repeated regularly. The "2012 London Olympics" can be presented both as an Event in the series "Olympic Games", and as an EventSeries that included a number of sporting competitions as Events. The nature of the association between the events in an EventSeries can vary, but typical examples could include a thematic event series (e.g. topical meetups or classes), or a series of regular events that share a location, attendee group and/or organizers. EventSeries has been defined as a kind of Event to make it easy for publishers to use it in an Event context without worrying about which kinds of series are really event-like enough to call an Event. In general an EventSeries may seem more Event-like when the period of time is compact and when aspects such as location are fixed, but it may also sometimes prove useful to describe a longer-term series as an Event.

WritePermission
type: DigitalDocumentPermissionType
comment: Permission to write or edit the document.

DrivingSchoolVehicleUsage
type: CarUsageType
contributor: Automotive Ontology Working Group
comment: Indicates the usage of the vehicle for driving school.
isPartOf: auto.schema.org

applicationSubCategory
type: Property
domainIncludes: SoftwareApplication
rangeIncludes: Text
rangeIncludes: URL
comment: Subcategory of the application, e.g. 'Arcade Game'.

referenceQuantity
type: Property
comment: The reference quantity for which a certain price applies, e.g. 1 EUR per 4 kWh of electricity. This property is a replacement for unitOfMeasurement for the advanced cases where the price does not relate to a standard unit.
domainIncludes: UnitPriceSpecification
rangeIncludes: QuantitativeValue
contributor: GoodRelationsTerms

typicalAgeRange
type: Property
domainIncludes: CreativeWork
domainIncludes: Event
comment: The typical expected age range, e.g. '7-9', '11-'.
rangeIncludes: Text

readonlyValue
type: Property
domainIncludes: PropertyValueSpecification
rangeIncludes: Boolean
comment: Whether or not a property is mutable. Default is false. Specifying this for a property that also has a value makes it act similar to a "hidden" input in an HTML form.

buyer
type: Property
comment: A sub property of participant. The participant/person/organization that bought the object.
rangeIncludes: Person
rangeIncludes: Organization
domainIncludes: SellAction
sub property of: participant

participant
type: Property
rangeIncludes: Person
rangeIncludes: Organization
comment: Other co-agents that participated in the action indirectly. E.g. John wrote a book with *Steve*.
domainIncludes: Action

pattern
type: Property
isPartOf: pending.schema.org
rangeIncludes: DefinedTerm
rangeIncludes: Text
comment: A pattern that something has, for example 'polka dot', 'striped', 'Canadian flag'. Values are typically expressed as text, although links to controlled value schemes are also supported.
source: https://github.com/schemaorg/schemaorg/issues/1797
equivalent property: printDesignDescription
domainIncludes: Product
domainIncludes: CreativeWork

countryOfOrigin
type: Property
domainIncludes: Movie
domainIncludes: Product
domainIncludes: CreativeWork
domainIncludes: TVSeries
domainIncludes: TVSeason
domainIncludes: TVEpisode
equivalent property: originCountry
comment: The country of origin of something, including products as well as creative works such as movie and TV content. In the case of TV and movie, this would be the country of the principle offices of the production company or individual responsible for the movie. For other kinds of CreativeWork it is difficult to provide fully general guidance, and properties such as contentLocation and locationCreated may be more applicable. In the case of products, the country of origin of the product. The exact interpretation of this may vary by context and product type, and cannot be fully enumerated here.
rangeIncludes: Country

OnSitePickup
type: DeliveryMethod
comment: A DeliveryMethod in which an item is collected on site, e.g. in a store or at a box office.

billingIncrement
type: Property
domainIncludes: UnitPriceSpecification
contributor: GoodRelationsTerms
rangeIncludes: Number
comment: This property specifies the minimal quantity and rounding increment that will be the basis for the billing. The unit of measurement is specified by the unitCode property.

ReturnInStore
type: ReturnMethodEnumeration
source: https://github.com/schemaorg/schemaorg/issues/2880
isPartOf: pending.schema.org
comment: Specifies that product returns must be made in a store.

availableStrength
type: Property
domainIncludes: Drug
rangeIncludes: DrugStrength
comment: An available dosage strength for the drug.
isPartOf: health-lifesci.schema.org

WearableMeasurementBack
type: WearableMeasurementTypeEnumeration
source: https://github.com/schemaorg/schemaorg/issues/2811
isPartOf: pending.schema.org
comment: Measurement of the back section, for example of a jacket.

TreatmentIndication
type: Class
isPartOf: health-lifesci.schema.org
subclass of: MedicalIndication
comment: An indication for treating an underlying condition, symptom, etc.

availabilityStarts
type: Property
domainIncludes: ActionAccessSpecification
domainIncludes: Demand
domainIncludes: Offer
rangeIncludes: DateTime
rangeIncludes: Date
rangeIncludes: Time
comment: The beginning of the availability of the product or service included in the offer.
contributor: GoodRelationsTerms
source: https://github.com/schemaorg/schemaorg/issues/1741

subStageSuffix
type: Property
comment: The substage, e.g. 'a' for Stage IIIa.
isPartOf: health-lifesci.schema.org
domainIncludes: MedicalConditionStage
rangeIncludes: Text

salaryUponCompletion
type: Property
comment: The expected salary upon completing the training.
source: https://github.com/schemaorg/schemaorg/issues/2289
domainIncludes: EducationalOccupationalProgram
rangeIncludes: MonetaryAmountDistribution
isPartOf: pending.schema.org

vehicleConfiguration
type: Property
contributor: Automotive Ontology Working Group
rangeIncludes: Text
domainIncludes: Vehicle
comment: A short text indicating the configuration of the vehicle, e.g. '5dr hatchback ST 2.5 MT 225 hp' or 'limited edition'.

eligibleWithSupplier
type: Property
comment: The supplier of the incentivized item/service for which the incentive is valid for such as a utility company, merchant, or contractor.
domainIncludes: FinancialIncentive
isPartOf: pending.schema.org
source: https://github.com/schemaorg/schemaorg/issues/3572
rangeIncludes: Organization

claimInterpreter
type: Property
comment: For a Claim interpreted from MediaObject content, the interpretedAsClaim property can be used to indicate a claim contained, implied or refined from the content of a MediaObject.
rangeIncludes: Person
rangeIncludes: Organization
domainIncludes: Claim
source: https://github.com/schemaorg/schemaorg/issues/2450
isPartOf: pending.schema.org

relatedTo
type: Property
domainIncludes: Person
rangeIncludes: Person
comment: The most generic familial relation.

PublicSwimmingPool
type: Class
comment: A public swimming pool.
subclass of: SportsActivityLocation

PreOrder
type: ItemAvailability
comment: Indicates that the item is available for pre-order.

associatedArticle
type: Property
comment: A NewsArticle associated with the Media Object.
domainIncludes: MediaObject
rangeIncludes: NewsArticle

Head
type: PhysicalExam
comment: Head assessment with clinical examination.
isPartOf: health-lifesci.schema.org

Surgical
type: MedicalSpecialty
comment: A specific branch of medical science that pertains to treating diseases, injuries and deformities by manual and instrumental means.
isPartOf: health-lifesci.schema.org

candidate
type: Property
sub property of: object
comment: A sub property of object. The candidate subject of this action.
domainIncludes: VoteAction
rangeIncludes: Person

object
type: Property
comment: The object upon which the action is carried out, whose state is kept intact or changed. Also known as the semantic roles patient, affected or undergoer (which change their state) or theme (which doesn't). E.g. John read *a book*.
domainIncludes: Action
rangeIncludes: Thing

smiles
type: Property
source: MolecularEntity
sub property of: hasRepresentation
domainIncludes: MolecularEntity
comment: A specification in form of a line notation for describing the structure of chemical species using short ASCII strings. Double bond stereochemistry \ indicators may need to be escaped in the string in formats where the backslash is an escape character.
rangeIncludes: Text
isPartOf: pending.schema.org

hasRepresentation
type: Property
comment: A common representation such as a protein sequence or chemical structure for this entity. For images use schema.org/image.
domainIncludes: BioChemEntity
isPartOf: pending.schema.org
rangeIncludes: Text
rangeIncludes: URL
rangeIncludes: PropertyValue
source: www.bioschemas.org

supportingData
type: Property
domainIncludes: SoftwareApplication
comment: Supporting data for a SoftwareApplication.
rangeIncludes: DataFeed

Nonprofit501c10
type: USNonprofitType
comment: Nonprofit501c10: Non-profit type referring to Domestic Fraternal Societies and Associations.
isPartOf: pending.schema.org
source: https://github.com/schemaorg/schemaorg/issues/2543

priceCurrency
type: Property
domainIncludes: Offer
domainIncludes: Ticket
domainIncludes: TradeAction
domainIncludes: Reservation
domainIncludes: DonateAction
domainIncludes: PriceSpecification
rangeIncludes: Text
sub property of: hasCurrency
comment: The currency of the price, or a price component when attached to PriceSpecification and its subtypes.\n\nUse standard formats: [ISO 4217 currency format](http://en.wikipedia.org/wiki/ISO_4217), e.g. "USD"; [Ticker symbol](https://en.wikipedia.org/wiki/List_of_cryptocurrencies) for cryptocurrencies, e.g. "BTC"; well known names for [Local Exchange Trading Systems](https://en.wikipedia.org/wiki/Local_exchange_trading_system) (LETS) and other currency types, e.g. "Ithaca HOUR".

WatchAction
type: Class
comment: The act of consuming dynamic/moving visual content.
subclass of: ConsumeAction

GovernmentPermit
type: Class
subclass of: Permit
comment: A permit issued by a government agency.

subEvents
type: Property
supersededBy: subEvent
rangeIncludes: Event
comment: Events that are a part of this event. For example, a conference event includes many presentations, each subEvents of the conference.
domainIncludes: Event

subEvent
type: Property
comment: An Event that is part of this event. For example, a conference event includes many presentations, each of which is a subEvent of the conference.
rangeIncludes: Event
domainIncludes: Event
inverseOf: superEvent

numberOfPartialBathrooms
type: Property
domainIncludes: FloorPlan
domainIncludes: Accommodation
comment: Number of partial bathrooms - The total number of half and ¼ bathrooms in an Accommodation. This corresponds to the [BathroomsPartial field in RESO](https://ddwiki.reso.org/display/DDW17/BathroomsPartial+Field).
source: https://github.com/schemaorg/schemaorg/issues/2373
rangeIncludes: Number
isPartOf: pending.schema.org

partySize
type: Property
domainIncludes: TaxiReservation
domainIncludes: FoodEstablishmentReservation
rangeIncludes: Integer
rangeIncludes: QuantitativeValue
comment: Number of people the reservation should accommodate.

servesCuisine
type: Property
comment: The cuisine of the restaurant.
rangeIncludes: Text
domainIncludes: FoodEstablishment

correctionsPolicy
type: Property
comment: For an Organization (e.g. NewsMediaOrganization), a statement describing (in news media, the newsroom’s) disclosure and correction policy for errors.
domainIncludes: NewsMediaOrganization
domainIncludes: Organization
sub property of: publishingPrinciples
rangeIncludes: URL
rangeIncludes: CreativeWork
source: https://github.com/schemaorg/schemaorg/issues/1525
contributor: TP
isPartOf: pending.schema.org

publishingPrinciples
type: Property
domainIncludes: Person
domainIncludes: Organization
domainIncludes: CreativeWork
rangeIncludes: CreativeWork
rangeIncludes: URL
comment: The publishingPrinciples property indicates (typically via URL) a document describing the editorial principles of an Organization (or individual, e.g. a Person writing a blog) that relate to their activities as a publisher, e.g. ethics or diversity policies. When applied to a CreativeWork (e.g. NewsArticle) the principles are those of the party primarily responsible for the creation of the CreativeWork. While such policies are most typically expressed in natural language, sometimes related information (e.g. indicating a funder) can be expressed using schema.org terminology.

pageEnd
type: Property
rangeIncludes: Integer
rangeIncludes: Text
equivalent property: pageEnd
domainIncludes: PublicationIssue
domainIncludes: Article
domainIncludes: PublicationVolume
domainIncludes: Chapter
contributor: bibex
comment: The page on which the work ends; for example "138" or "xvi".

programPrerequisites
type: Property
domainIncludes: EducationalOccupationalProgram
rangeIncludes: Course
rangeIncludes: EducationalOccupationalCredential
rangeIncludes: AlignmentObject
rangeIncludes: Text
isPartOf: pending.schema.org
source: https://github.com/schemaorg/schemaorg/issues/2289
comment: Prerequisites for enrolling in the program.

WearableMeasurementChestOrBust
type: WearableMeasurementTypeEnumeration
source: https://github.com/schemaorg/schemaorg/issues/2811
comment: Measurement of the chest/bust section, for example of a suit.
isPartOf: pending.schema.org

legislationCommences
type: Property
comment: Another legislation that this one sets into force.
contributor: ELI
rangeIncludes: Legislation
domainIncludes: Legislation
source: eli
source: https://github.com/schemaorg/schemaorg/issues/2698
equivalent property: commences
sub property of: legislationChanges
isPartOf: pending.schema.org

legislationChanges
type: Property
source: https://github.com/schemaorg/schemaorg/issues/1156
source: eli
domainIncludes: Legislation
contributor: ELI
rangeIncludes: Legislation
comment: Another legislation that this legislation changes. This encompasses the notions of amendment, replacement, correction, repeal, or other types of change. This may be a direct change (textual or non-textual amendment) or a consequential or indirect change. The property is to be used to express the existence of a change relationship between two acts rather than the existence of a consolidated version of the text that shows the result of the change. For consolidation relationships, use the legislationConsolidates property.
isPartOf: pending.schema.org
equivalent property: changes

productionCompany
type: Property
domainIncludes: MediaObject
domainIncludes: Episode
domainIncludes: CreativeWorkSeason
domainIncludes: MovieSeries
domainIncludes: TVSeries
domainIncludes: RadioSeries
domainIncludes: VideoGameSeries
domainIncludes: Movie
comment: The production company or studio responsible for the item, e.g. series, video game, episode etc.
rangeIncludes: Organization

carbohydrateContent
type: Property
rangeIncludes: Mass
domainIncludes: NutritionInformation
comment: The number of grams of carbohydrates.

validForMemberTier
type: Property
domainIncludes: MerchantReturnPolicy
domainIncludes: Offer
domainIncludes: OfferShippingDetails
domainIncludes: ShippingService
domainIncludes: PriceSpecification
isPartOf: pending.schema.org
comment: The membership program tier an Offer (or a PriceSpecification, OfferShippingDetails, or MerchantReturnPolicy under an Offer) is valid for.
source: https://github.com/schemaorg/schemaorg/issues/3617
source: https://github.com/schemaorg/schemaorg/issues/3563
rangeIncludes: MemberProgramTier

MayTreatHealthAspect
type: HealthAspectEnumeration
comment: Related topics may be treated by a Topic.
source: https://github.com/schemaorg/schemaorg/issues/2374
isPartOf: pending.schema.org

musicGroupMember
type: Property
rangeIncludes: Person
domainIncludes: MusicGroup
comment: A member of a music group—for example, John, Paul, George, or Ringo.
supersededBy: member

member
type: Property
rangeIncludes: Organization
rangeIncludes: Person
comment: A member of an Organization or a ProgramMembership. Organizations can be members of organizations; ProgramMembership is typically for individuals.
equivalent property: hasMember
inverseOf: memberOf
domainIncludes: ProgramMembership
domainIncludes: Organization

FAQPage
type: Class
source: https://github.com/schemaorg/schemaorg/issues/1723
comment: A FAQPage is a WebPage presenting one or more "[Frequently asked questions](https://en.wikipedia.org/wiki/FAQ)" (see also QAPage).
subclass of: WebPage

cashBack
type: Property
rangeIncludes: Boolean
rangeIncludes: Number
contributor: FIBO
isPartOf: pending.schema.org
source: https://github.com/schemaorg/schemaorg/issues/1253
comment: A cardholder benefit that pays the cardholder a small percentage of their net expenditures.
domainIncludes: PaymentCard

exercisePlan
type: Property
domainIncludes: ExerciseAction
sub property of: instrument
isPartOf: health-lifesci.schema.org
rangeIncludes: ExercisePlan
comment: A sub property of instrument. The exercise plan used on this action.

instrument
type: Property
comment: The object that helped the agent perform the action. E.g. John wrote a book with *a pen*.
rangeIncludes: Thing
domainIncludes: Action

TraditionalChinese
type: MedicineSystem
isPartOf: health-lifesci.schema.org
comment: A system of medicine based on common theoretical concepts that originated in China and evolved over thousands of years, that uses herbs, acupuncture, exercise, massage, dietary therapy, and other methods to treat a wide range of conditions.

question
type: Property
domainIncludes: AskAction
comment: A sub property of object. A question.
sub property of: object
rangeIncludes: Question

isPlanForApartment
type: Property
source: https://github.com/schemaorg/schemaorg/issues/2373
rangeIncludes: Accommodation
domainIncludes: FloorPlan
comment: Indicates some accommodation that this floor plan describes.
isPartOf: pending.schema.org

ReportedDoseSchedule
type: Class
isPartOf: health-lifesci.schema.org
comment: A patient-reported or observed dosing schedule for a drug or supplement.
subclass of: DoseSchedule

accessMode
type: Property
comment: The human sensory perceptual system or cognitive faculty through which a person may process or perceive information. Values should be drawn from the [approved vocabulary](https://www.w3.org/2021/a11y-discov-vocab/latest/#accessMode-vocabulary).
source: https://github.com/schemaorg/schemaorg/issues/1100
rangeIncludes: Text
domainIncludes: CreativeWork

includesHealthPlanNetwork
type: Property
rangeIncludes: HealthPlanNetwork
isPartOf: pending.schema.org
source: https://github.com/schemaorg/schemaorg/issues/1062
comment: Networks covered by this plan.
domainIncludes: HealthInsurancePlan

availabilityEnds
type: Property
domainIncludes: ActionAccessSpecification
domainIncludes: Offer
domainIncludes: Demand
rangeIncludes: DateTime
rangeIncludes: Date
rangeIncludes: Time
contributor: GoodRelationsTerms
source: https://github.com/schemaorg/schemaorg/issues/1741
comment: The end of the availability of the product or service included in the offer.

relatedStructure
type: Property
isPartOf: health-lifesci.schema.org
comment: Related anatomical structure(s) that are not part of the system but relate or connect to it, such as vascular bundles associated with an organ system.
rangeIncludes: AnatomicalStructure
domainIncludes: AnatomicalSystem

width
type: Property
domainIncludes: Product
domainIncludes: MediaObject
domainIncludes: VisualArtwork
domainIncludes: OfferShippingDetails
domainIncludes: ShippingConditions
comment: The width of the item.
source: https://github.com/schemaorg/schemaorg/issues/3617
rangeIncludes: QuantitativeValue
rangeIncludes: Distance

EmployerAggregateRating
type: Class
subclass of: AggregateRating
comment: An aggregate rating of an Organization related to its role as an employer.
source: https://github.com/schemaorg/schemaorg/issues/1689

numberOfItems
type: Property
comment: The number of items in an ItemList. Note that some descriptions might not fully describe all items in a list (e.g., multi-page pagination); in such cases, the numberOfItems would be for the entire list.
domainIncludes: ItemList
rangeIncludes: Integer

MisconceptionsHealthAspect
type: HealthAspectEnumeration
source: https://github.com/schemaorg/schemaorg/issues/2374
comment: Content about common misconceptions and myths that are related to a topic.
isPartOf: pending.schema.org

WearableSizeGroupWomens
type: WearableSizeGroupEnumeration
isPartOf: pending.schema.org
comment: Size group "Womens" for wearables.
source: https://github.com/schemaorg/schemaorg/issues/2811

beneficiaryBank
type: Property
comment: A bank or bank’s branch, financial institution or international financial institution operating the beneficiary’s bank account or releasing funds for the beneficiary.
rangeIncludes: BankOrCreditUnion
rangeIncludes: Text
source: https://github.com/schemaorg/schemaorg/issues/1253
domainIncludes: MoneyTransfer
contributor: FIBO
isPartOf: pending.schema.org

globalLocationNumber
type: Property
domainIncludes: Place
domainIncludes: Person
domainIncludes: Organization
rangeIncludes: Text
sub property of: identifier
comment: The [Global Location Number](http://www.gs1.org/gln) (GLN, sometimes also referred to as International Location Number or ILN) of the respective organization, person, or place. The GLN is a 13-digit number used to identify parties and physical locations.
contributor: GoodRelationsTerms
equivalent property: gLNId
equivalent property: globalLocationNumber

departureGate
type: Property
rangeIncludes: Text
comment: Identifier of the flight's departure gate.
domainIncludes: Flight

MultiPlayer
type: GamePlayMode
comment: Play mode: MultiPlayer. Requiring or allowing multiple human players to play simultaneously.

bioChemSimilarity
type: Property
rangeIncludes: BioChemEntity
isPartOf: pending.schema.org
comment: A similar BioChemEntity, e.g., obtained by fingerprint similarity algorithms.
source: www.bioschemas.org
domainIncludes: BioChemEntity

expectedArrivalUntil
type: Property
domainIncludes: ParcelDelivery
comment: The latest date the package may arrive.
rangeIncludes: Date
rangeIncludes: DateTime

LiveAlbum
type: MusicAlbumProductionType
contributor: MBZ
comment: LiveAlbum.

sizeSystem
type: Property
comment: The size system used to identify a product's size. Typically either a standard (for example, "GS1" or "ISO-EN13402"), country code (for example "US" or "JP"), or a measuring system (for example "Metric" or "Imperial").
isPartOf: pending.schema.org
domainIncludes: SizeSpecification
rangeIncludes: SizeSystemEnumeration
rangeIncludes: Text
source: https://github.com/schemaorg/schemaorg/issues/2811

applicationSuite
type: Property
comment: The name of the application suite to which the application belongs (e.g. Excel belongs to Office).
rangeIncludes: Text
domainIncludes: SoftwareApplication

typicalCreditsPerTerm
type: Property
domainIncludes: EducationalOccupationalProgram
rangeIncludes: StructuredValue
rangeIncludes: Integer
comment: The number of credits or units a full-time student would be expected to take in 1 term however 'term' is defined by the institution.
isPartOf: pending.schema.org
source: https://github.com/schemaorg/schemaorg/issues/2419

ExchangeRefund
type: RefundTypeEnumeration
isPartOf: pending.schema.org
source: https://github.com/schemaorg/schemaorg/issues/2288
comment: Specifies that a refund can be done as an exchange for the same product.

evidenceLevel
type: Property
isPartOf: health-lifesci.schema.org
rangeIncludes: MedicalEvidenceLevel
domainIncludes: MedicalGuideline
comment: Strength of evidence of the data used to formulate the guideline (enumerated).

CompositeCaptureDigitalSource
type: IPTCDigitalSourceEnumeration
source: https://github.com/schemaorg/schemaorg/issues/3392
comment: Content coded as 'composite capture' using the IPTC digital source type vocabulary.
isPartOf: pending.schema.org

organizer
type: Property
domainIncludes: Event
rangeIncludes: Person
rangeIncludes: Organization
comment: An organizer of an Event.

merchantReturnLink
type: Property
domainIncludes: MerchantReturnPolicy
isPartOf: pending.schema.org
source: https://github.com/schemaorg/schemaorg/issues/2288
rangeIncludes: URL
comment: Specifies a Web page or service by URL, for product returns.

geoTouches
type: Property
rangeIncludes: Place
rangeIncludes: GeospatialGeometry
domainIncludes: GeospatialGeometry
domainIncludes: Place
comment: Represents spatial relations in which two geometries (or the places they represent) touch: "they have at least one boundary point in common, but no interior points." (A symmetric relationship, as defined in [DE-9IM](https://en.wikipedia.org/wiki/DE-9IM).)

taxonRank
type: Property
rangeIncludes: Text
rangeIncludes: URL
rangeIncludes: PropertyValue
source: Taxon
domainIncludes: Taxon
isPartOf: pending.schema.org
comment: The taxonomic rank of this taxon given preferably as a URI from a controlled vocabulary – typically the ranks from TDWG TaxonRank ontology or equivalent Wikidata URIs.

additionalName
type: Property
sub property of: alternateName
domainIncludes: Person
comment: An additional name for a Person, can be used for a middle name.
rangeIncludes: Text

alternateName
type: Property
domainIncludes: Thing
rangeIncludes: Text
comment: An alias for the item.

cvdNumICUBeds
type: Property
isPartOf: pending.schema.org
comment: numicubeds - ICU BEDS: Total number of staffed inpatient intensive care unit (ICU) beds.
source: https://github.com/schemaorg/schemaorg/issues/2521
rangeIncludes: Number
domainIncludes: CDCPMDRecord

distinguishingSign
type: Property
isPartOf: health-lifesci.schema.org
rangeIncludes: MedicalSignOrSymptom
comment: One of a set of signs and symptoms that can be used to distinguish this diagnosis from others in the differential diagnosis.
domainIncludes: DDxElement

hasShippingService
type: Property
isPartOf: pending.schema.org
comment: Specification of a shipping service offered by the organization.
rangeIncludes: ShippingService
domainIncludes: Organization
domainIncludes: OfferShippingDetails
source: https://github.com/schemaorg/schemaorg/issues/3617

AcceptAction
type: Class
comment: The act of committing to/adopting an object.\n\nRelated actions:\n\n* RejectAction: The antonym of AcceptAction.
subclass of: AllocateAction

usesHealthPlanIdStandard
type: Property
source: https://github.com/schemaorg/schemaorg/issues/1062
comment: The standard for interpreting the Plan ID. The preferred is "HIOS". See the Centers for Medicare & Medicaid Services for more details.
rangeIncludes: URL
rangeIncludes: Text
domainIncludes: HealthInsurancePlan
isPartOf: pending.schema.org

MusicStore
type: Class
subclass of: Store
comment: A music store.

issn
type: Property
comment: The International Standard Serial Number (ISSN) that identifies this serial publication. You can repeat this property to identify different formats of, or the linking ISSN (ISSN-L) for, this serial publication.
equivalent property: issn
domainIncludes: CreativeWorkSeries
domainIncludes: Blog
domainIncludes: WebSite
domainIncludes: Dataset
sub property of: identifier
contributor: bibex
rangeIncludes: Text

paymentMethod
type: Property
domainIncludes: Order
domainIncludes: Invoice
rangeIncludes: PaymentMethod
rangeIncludes: Text
source: https://github.com/schemaorg/schemaorg/issues/3537
comment: The name of the credit card or other method of payment for the order.
sub property of: hasPaymentMechanism

ChildrensEvent
type: Class
comment: Event type: Children's event.
subclass of: Event

measurementMethod
type: Property
comment: A subproperty of measurementTechnique that can be used for specifying specific methods, in particular via MeasurementMethodEnum.
rangeIncludes: Text
rangeIncludes: MeasurementMethodEnum
rangeIncludes: DefinedTerm
rangeIncludes: URL
domainIncludes: Observation
domainIncludes: StatisticalVariable
domainIncludes: Dataset
domainIncludes: DataCatalog
domainIncludes: DataDownload
domainIncludes: PropertyValue
sub property of: measurementTechnique
isPartOf: pending.schema.org
source: https://github.com/schemaorg/schemaorg/issues/1425

measurementTechnique
type: Property
domainIncludes: DataDownload
domainIncludes: PropertyValue
domainIncludes: Observation
domainIncludes: StatisticalVariable
domainIncludes: Dataset
domainIncludes: DataCatalog
rangeIncludes: MeasurementMethodEnum
rangeIncludes: DefinedTerm
rangeIncludes: URL
rangeIncludes: Text
source: https://github.com/schemaorg/schemaorg/issues/1425
comment: A technique, method or technology used in an Observation, StatisticalVariable or Dataset (or DataDownload, DataCatalog), corresponding to the method used for measuring the corresponding variable(s) (for datasets, described using variableMeasured; for Observation, a StatisticalVariable). Often but not necessarily each variableMeasured will have an explicit representation as (or mapping to) an property such as those defined in Schema.org, or other RDF vocabularies and "knowledge graphs". In that case the subproperty of variableMeasured called measuredProperty is applicable. The measurementTechnique property helps when extra clarification is needed about how a measuredProperty was measured. This is oriented towards scientific and scholarly dataset publication but may have broader applicability; it is not intended as a full representation of measurement, but can often serve as a high level summary for dataset discovery. For example, if variableMeasured is: molecule concentration, measurementTechnique could be: "mass spectrometry" or "nmr spectroscopy" or "colorimetry" or "immunofluorescence". If the variableMeasured is "depression rating", the measurementTechnique could be "Zung Scale" or "HAM-D" or "Beck Depression Inventory". If there are several variableMeasured properties recorded for some given data object, use a PropertyValue for each variableMeasured and attach the corresponding measurementTechnique. The value can also be from an enumeration, organized as a MeasurementMetholdEnumeration.
isPartOf: pending.schema.org

inChIKey
type: Property
rangeIncludes: Text
comment: InChIKey is a hashed version of the full InChI (using the SHA-256 algorithm).
sub property of: hasRepresentation
isPartOf: pending.schema.org
source: MolecularEntity
domainIncludes: MolecularEntity

businessDays
type: Property
source: https://github.com/schemaorg/schemaorg/issues/3617
source: https://github.com/schemaorg/schemaorg/issues/2506
rangeIncludes: OpeningHoursSpecification
rangeIncludes: DayOfWeek
domainIncludes: ShippingDeliveryTime
domainIncludes: ServicePeriod
comment: Days of the week when the merchant typically operates, indicated via opening hours markup.

replacee
type: Property
sub property of: object
comment: A sub property of object. The object that is being replaced.
rangeIncludes: Thing
domainIncludes: ReplaceAction

activityDuration
type: Property
comment: Length of time to engage in the activity.
rangeIncludes: Duration
rangeIncludes: QuantitativeValue
isPartOf: health-lifesci.schema.org
domainIncludes: ExercisePlan

termDuration
type: Property
isPartOf: pending.schema.org
rangeIncludes: Duration
comment: The amount of time in a term as defined by the institution. A term is a length of time where students take one or more classes. Semesters and quarters are common units for term.
source: https://github.com/schemaorg/schemaorg/issues/2419
domainIncludes: EducationalOccupationalProgram

AutoRepair
type: Class
comment: Car repair business.
subclass of: AutomotiveBusiness

videoFormat
type: Property
comment: The type of screening or video broadcast used (e.g. IMAX, 3D, SD, HD, etc.).
domainIncludes: ScreeningEvent
domainIncludes: BroadcastService
domainIncludes: BroadcastEvent
rangeIncludes: Text

additionalProperty
type: Property
domainIncludes: MerchantReturnPolicy
domainIncludes: Offer
domainIncludes: QuantitativeValue
domainIncludes: Product
domainIncludes: QualitativeValue
domainIncludes: Place
rangeIncludes: PropertyValue
comment: A property-value pair representing an additional characteristic of the entity, e.g. a product feature or another characteristic for which there is no matching property in schema.org.\n\nNote: Publishers should be aware that applications designed to use specific schema.org properties (e.g. http://schema.org/width, http://schema.org/color, http://schema.org/gtin13, ...) will typically expect such data to be provided using those properties, rather than using the generic property/value mechanism.

warrantyScope
type: Property
rangeIncludes: WarrantyScope
domainIncludes: WarrantyPromise
contributor: GoodRelationsTerms
comment: The scope of the warranty promise.

childMaxAge
type: Property
rangeIncludes: Number
domainIncludes: ParentAudience
comment: Maximal age of the child.

OpenTrial
type: MedicalTrialDesign
comment: A trial design in which the researcher knows the full details of the treatment, and so does the patient.
isPartOf: health-lifesci.schema.org

ComicCoverArt
type: Class
subclass of: ComicStory
subclass of: CoverArt
comment: The artwork on the cover of a comic.
isPartOf: bib.schema.org

artform
type: Property
comment: e.g. Painting, Drawing, Sculpture, Print, Photograph, Assemblage, Collage, etc.
domainIncludes: VisualArtwork
rangeIncludes: URL
rangeIncludes: Text

headline
type: Property
comment: Headline of the article.
rangeIncludes: Text
domainIncludes: CreativeWork

price
type: Property
domainIncludes: PriceSpecification
domainIncludes: Offer
domainIncludes: DonateAction
domainIncludes: TradeAction
sub property of: hasNumericValue
sub property of: hasAmount
rangeIncludes: Number
rangeIncludes: Text
comment: The offer price of a product, or of a price component when attached to PriceSpecification and its subtypes.\n\nUsage guidelines:\n\n* Use the priceCurrency property (with standard formats: [ISO 4217 currency format](http://en.wikipedia.org/wiki/ISO_4217), e.g. "USD"; [Ticker symbol](https://en.wikipedia.org/wiki/List_of_cryptocurrencies) for cryptocurrencies, e.g. "BTC"; well known names for [Local Exchange Trading Systems](https://en.wikipedia.org/wiki/Local_exchange_trading_system) (LETS) and other currency types, e.g. "Ithaca HOUR") instead of including [ambiguous symbols](http://en.wikipedia.org/wiki/Dollar_sign#Currencies_that_use_the_dollar_or_peso_sign) such as '$' in the value.\n* Use '.' (Unicode 'FULL STOP' (U+002E)) rather than ',' to indicate a decimal point. Avoid using these symbols as a readability separator.\n* Note that both [RDFa](http://www.w3.org/TR/xhtml-rdfa-primer/#using-the-content-attribute) and Microdata syntax allow the use of a "content=" attribute for publishing simple machine-readable values alongside more human-friendly formatting.\n* Use values from 0123456789 (Unicode 'DIGIT ZERO' (U+0030) to 'DIGIT NINE' (U+0039)) rather than superficially similar Unicode symbols.

author
type: Property
rangeIncludes: Organization
rangeIncludes: Person
domainIncludes: CreativeWork
domainIncludes: Rating
comment: The author of this content or rating. Please note that author is special in that HTML 5 provides a special mechanism for indicating authorship via the rel tag. That is equivalent to this and may be used interchangeably.

amenityFeature
type: Property
domainIncludes: Accommodation
domainIncludes: FloorPlan
domainIncludes: Place
domainIncludes: LodgingBusiness
comment: An amenity feature (e.g. a characteristic or service) of the Accommodation. This generic property does not make a statement about whether the feature is included in an offer for the main accommodation or available at extra costs.
rangeIncludes: LocationFeatureSpecification
contributor: STI Accommodation Ontology

EUEnergyEfficiencyCategoryB
type: EUEnergyEfficiencyEnumeration
source: https://github.com/schemaorg/schemaorg/issues/2670
comment: Represents EU Energy Efficiency Class B as defined in EU energy labeling regulations.
isPartOf: pending.schema.org

RoofingContractor
type: Class
comment: A roofing contractor.
subclass of: HomeAndConstructionBusiness

masthead
type: Property
contributor: TP
isPartOf: pending.schema.org
comment: For a NewsMediaOrganization, a link to the masthead page or a page listing top editorial management.
rangeIncludes: CreativeWork
rangeIncludes: URL
domainIncludes: NewsMediaOrganization
sub property of: publishingPrinciples
source: https://github.com/schemaorg/schemaorg/issues/1525

floorSize
type: Property
domainIncludes: Accommodation
domainIncludes: FloorPlan
contributor: STI Accommodation Ontology
comment: The size of the accommodation, e.g. in square meter or squarefoot. Typical unit code(s): MTK for square meter, FTK for square foot, or YDK for square yard.
rangeIncludes: QuantitativeValue

ReviewNewsArticle
type: Class
isPartOf: pending.schema.org
comment: A NewsArticle and CriticReview providing a professional critic's assessment of a service, product, performance, or artistic or literary work.
subclass of: NewsArticle
subclass of: CriticReview
source: https://github.com/schemaorg/schemaorg/issues/1525
contributor: TP

minValue
type: Property
domainIncludes: PropertyValue
domainIncludes: QuantitativeValue
domainIncludes: PropertyValueSpecification
domainIncludes: MonetaryAmount
comment: The lower value of some characteristic or property.
contributor: GoodRelationsTerms
rangeIncludes: Number
sub property of: hasLowerBound

accommodationCategory
type: Property
source: https://github.com/schemaorg/schemaorg/issues/2373
domainIncludes: Accommodation
sub property of: category
rangeIncludes: Text
isPartOf: pending.schema.org
comment: Category of an Accommodation, following real estate conventions, e.g. RESO (see [PropertySubType](https://ddwiki.reso.org/display/DDW17/PropertySubType+Field), and [PropertyType](https://ddwiki.reso.org/display/DDW17/PropertyType+Field) fields for suggested values).

category
type: Property
domainIncludes: Product
domainIncludes: PhysicalActivity
domainIncludes: Recommendation
domainIncludes: Invoice
domainIncludes: Offer
domainIncludes: Service
domainIncludes: ActionAccessSpecification
domainIncludes: Guide
domainIncludes: SpecialAnnouncement
rangeIncludes: Text
rangeIncludes: PhysicalActivityCategory
rangeIncludes: CategoryCode
rangeIncludes: Thing
rangeIncludes: URL
source: https://github.com/schemaorg/schemaorg/issues/1741
source: https://github.com/schemaorg/schemaorg/issues/2490
comment: A category for the item. Greater signs or slashes can be used to informally indicate a category hierarchy.

ApplyAction
type: Class
subclass of: OrganizeAction
comment: The act of registering to an organization/service without the guarantee to receive it.\n\nRelated actions:\n\n* RegisterAction: Unlike RegisterAction, ApplyAction has no guarantees that the application will be accepted.

PrognosisHealthAspect
type: HealthAspectEnumeration
source: https://github.com/schemaorg/schemaorg/issues/2374
comment: Typical progression and happenings of life course of the topic.
isPartOf: pending.schema.org

WearableMeasurementInseam
type: WearableMeasurementTypeEnumeration
isPartOf: pending.schema.org
source: https://github.com/schemaorg/schemaorg/issues/2811
comment: Measurement of the inseam, for example of pants.

episodeNumber
type: Property
rangeIncludes: Text
rangeIncludes: Integer
sub property of: position
domainIncludes: Episode
comment: Position of the episode within an ordered group of episodes.

position
type: Property
domainIncludes: ListItem
domainIncludes: CreativeWork
rangeIncludes: Text
rangeIncludes: Integer
comment: The position of an item in a series or sequence of items.

knowsLanguage
type: Property
isPartOf: pending.schema.org
domainIncludes: Organization
domainIncludes: Person
source: https://github.com/schemaorg/schemaorg/issues/1688
rangeIncludes: Language
rangeIncludes: Text
contributor: TP
comment: Of a Person, and less typically of an Organization, to indicate a known language. We do not distinguish skill levels or reading/writing/speaking/signing here. Use language codes from the [IETF BCP 47 standard](http://tools.ietf.org/html/bcp47).

ExerciseGym
type: Class
subclass of: SportsActivityLocation
comment: A gym.

Nonprofit501e
type: USNonprofitType
comment: Nonprofit501e: Non-profit type referring to Cooperative Hospital Service Organizations.
source: https://github.com/schemaorg/schemaorg/issues/2543
isPartOf: pending.schema.org

GolfCourse
type: Class
comment: A golf course.
subclass of: SportsActivityLocation

realEstateAgent
type: Property
sub property of: participant
domainIncludes: RentAction
comment: A sub property of participant. The real estate agent involved in the action.
rangeIncludes: RealEstateAgent

feesAndCommissionsSpecification
type: Property
domainIncludes: FinancialProduct
domainIncludes: FinancialService
contributor: FIBO
comment: Description of fees, commissions, and other terms applied either to a class of financial product, or by a financial service organization.
rangeIncludes: URL
rangeIncludes: Text

expressedIn
type: Property
rangeIncludes: DefinedTerm
rangeIncludes: AnatomicalSystem
rangeIncludes: BioChemEntity
rangeIncludes: AnatomicalStructure
domainIncludes: Gene
source: Gene
comment: Tissue, organ, biological sample, etc in which activity of this gene has been observed experimentally. For example brain, digestive system.
isPartOf: pending.schema.org

Nonprofit501c18
type: USNonprofitType
source: https://github.com/schemaorg/schemaorg/issues/2543
isPartOf: pending.schema.org
comment: Nonprofit501c18: Non-profit type referring to Employee Funded Pension Trust (created before 25 June 1959).

BackgroundNewsArticle
type: Class
comment: A NewsArticle providing historical context, definition and detail on a specific topic (aka "explainer" or "backgrounder"). For example, an in-depth article or frequently-asked-questions ([FAQ](https://en.wikipedia.org/wiki/FAQ)) document on topics such as Climate Change or the European Union. Other kinds of background material from a non-news setting are often described using Book or Article, in particular ScholarlyArticle. See also NewsArticle for related vocabulary from a learning/education perspective.
contributor: TP
isPartOf: pending.schema.org
subclass of: NewsArticle
source: https://github.com/schemaorg/schemaorg/issues/1525

IncentiveStatusRetired
type: IncentiveStatus
source: https://github.com/schemaorg/schemaorg/issues/3572
comment: This incentive is not longer available.
isPartOf: pending.schema.org

LoginAction
type: Class
isPartOf: pending.schema.org
comment: The action of logging into a device or application.
subclass of: ControlAction
source: https://github.com/schemaorg/schemaorg/issues/4507

latitude
type: Property
sub property of: hasLatitude
rangeIncludes: Number
rangeIncludes: Text
domainIncludes: Place
domainIncludes: GeoCoordinates
comment: The latitude of a location. For example ```37.42242``` ([WGS 84](https://en.wikipedia.org/wiki/World_Geodetic_System)).

GovernmentOrganization
type: Class
subclass of: Organization
comment: A governmental organization or agency.

HobbyShop
type: Class
comment: A store that sells materials useful or necessary for various hobbies.
subclass of: Store

programMembershipUsed
type: Property
comment: Any membership in a frequent flyer, hotel loyalty program, etc. being applied to the reservation.
rangeIncludes: ProgramMembership
domainIncludes: Reservation

asin
type: Property
domainIncludes: Offer
domainIncludes: Product
domainIncludes: Demand
comment: An Amazon Standard Identification Number (ASIN) is a 10-character alphanumeric unique identifier assigned by Amazon.com and its partners for product identification within the Amazon organization (summary from [Wikipedia](https://en.wikipedia.org/wiki/Amazon_Standard_Identification_Number)'s article). Note also that this is a definition for how to include ASINs in Schema.org data, and not a definition of ASINs in general - see documentation from Amazon for authoritative details. ASINs are most commonly encoded as text strings, but the [asin] property supports URL/URI as potential values too.
rangeIncludes: URL
rangeIncludes: Text
isPartOf: pending.schema.org
sub property of: identifier
source: https://github.com/schemaorg/schemaorg/issues/2288

knowsAbout
type: Property
rangeIncludes: Text
rangeIncludes: Thing
rangeIncludes: URL
isPartOf: pending.schema.org
domainIncludes: Person
domainIncludes: Organization
source: https://github.com/schemaorg/schemaorg/issues/1688
comment: Of a Person, and less typically of an Organization, to indicate a topic that is known about - suggesting possible expertise but not implying it. We do not distinguish skill levels here, or relate this to educational content, events, objectives or JobPosting descriptions.
contributor: TP

winner
type: Property
comment: A sub property of participant. The winner of the action.
domainIncludes: LoseAction
rangeIncludes: Person
sub property of: participant

TelevisionStation
type: Class
comment: A television station.
subclass of: LocalBusiness

geographicArea
type: Property
comment: The geographic area associated with the audience.
rangeIncludes: AdministrativeArea
domainIncludes: Audience

MedicalGuidelineContraindication
type: Class
subclass of: MedicalGuideline
isPartOf: health-lifesci.schema.org
comment: A guideline contraindication that designates a process as harmful and where quality of the data supporting the contraindication is sound.

BodyMeasurementBust
type: BodyMeasurementTypeEnumeration
isPartOf: pending.schema.org
source: https://github.com/schemaorg/schemaorg/issues/2811
comment: Maximum girth of bust. Used, for example, to fit women's suits.

broadcastFrequency
type: Property
comment: The frequency used for over-the-air broadcasts. Numeric values or simple ranges, e.g. 87-99. In addition a shortcut idiom is supported for frequencies of AM and FM radio channels, e.g. "87 FM".
rangeIncludes: Text
rangeIncludes: BroadcastFrequencySpecification
source: https://github.com/schemaorg/schemaorg/issues/1004
domainIncludes: BroadcastService
domainIncludes: BroadcastChannel

OpinionNewsArticle
type: Class
subclass of: NewsArticle
source: https://github.com/schemaorg/schemaorg/issues/1525
contributor: TP
comment: An OpinionNewsArticle is a NewsArticle that primarily expresses opinions rather than journalistic reporting of news and events. For example, a NewsArticle consisting of a column or Blog/BlogPosting entry in the Opinions section of a news publication.
isPartOf: pending.schema.org

requiredQuantity
type: Property
rangeIncludes: Number
rangeIncludes: Text
rangeIncludes: QuantitativeValue
comment: The required quantity of the item(s).
domainIncludes: HowToItem

TypesHealthAspect
type: HealthAspectEnumeration
isPartOf: pending.schema.org
source: https://github.com/schemaorg/schemaorg/issues/2374
comment: Categorization and other types related to a topic.

WearableMeasurementHeight
type: WearableMeasurementTypeEnumeration
source: https://github.com/schemaorg/schemaorg/issues/2811
isPartOf: pending.schema.org
comment: Measurement of the height, for example the heel height of a shoe.

MotorcycleRepair
type: Class
subclass of: AutomotiveBusiness
comment: A motorcycle repair shop.

paymentUrl
type: Property
rangeIncludes: URL
sub property of: hasAddress
comment: The URL for sending a payment.
domainIncludes: Order

ComputerStore
type: Class
subclass of: Store
comment: A computer store.

requiredCollateral
type: Property
contributor: FIBO
rangeIncludes: Thing
rangeIncludes: Text
domainIncludes: LoanOrCredit
comment: Assets required to secure loan or credit repayments. It may take form of third party pledge, goods, financial instruments (cash, securities, etc.)

departureBoatTerminal
type: Property
rangeIncludes: BoatTerminal
source: https://github.com/schemaorg/schemaorg/issues/1755
domainIncludes: BoatTrip
isPartOf: pending.schema.org
comment: The terminal or port from which the boat departs.

exifData
type: Property
rangeIncludes: PropertyValue
rangeIncludes: Text
comment: exif data for this object.
domainIncludes: ImageObject

model
type: Property
sub property of: isClassifiedBy
comment: The model of the product. Use with the URL of a ProductModel or a textual representation of the model identifier. The URL of the ProductModel can be from an external source. It is recommended to additionally provide strong product identifiers via the gtin8/gtin13/gtin14 and mpn properties.
equivalent property: ModelName
domainIncludes: Product
rangeIncludes: Text
rangeIncludes: ProductModel

billingPeriod
type: Property
domainIncludes: Invoice
rangeIncludes: Duration
comment: The time interval used to compute the invoice.
equivalent property: billingPeriod

educationalProgramMode
type: Property
rangeIncludes: URL
rangeIncludes: Text
source: https://github.com/schemaorg/schemaorg/issues/2419
domainIncludes: EducationalOccupationalProgram
comment: Similar to courseMode, the medium or means of delivery of the program as a whole. The value may either be a text label (e.g. "online", "onsite" or "blended"; "synchronous" or "asynchronous"; "full-time" or "part-time") or a URL reference to a term from a controlled vocabulary (e.g. https://ceds.ed.gov/element/001311#Asynchronous ).
isPartOf: pending.schema.org

expertConsiderations
type: Property
isPartOf: health-lifesci.schema.org
domainIncludes: Diet
rangeIncludes: Text
comment: Medical expert advice related to the plan.

regionsAllowed
type: Property
comment: The regions where the media is allowed. If not specified, then it's assumed to be allowed everywhere. Specify the countries in [ISO 3166 format](http://en.wikipedia.org/wiki/ISO_3166).
domainIncludes: MediaObject
rangeIncludes: Place

option
type: Property
comment: A sub property of object. The options subject to this action.
supersededBy: actionOption
sub property of: object
rangeIncludes: Text
rangeIncludes: Thing
domainIncludes: ChooseAction

actionOption
type: Property
rangeIncludes: Thing
rangeIncludes: Text
comment: A sub property of object. The options subject to this action.
sub property of: object
domainIncludes: ChooseAction

vendor
type: Property
comment: 'vendor' is an earlier term for 'seller'.
domainIncludes: BuyAction
supersededBy: seller
rangeIncludes: Organization
rangeIncludes: Person
sub property of: participant

seller
type: Property
domainIncludes: Offer
domainIncludes: BuyAction
domainIncludes: Flight
domainIncludes: Order
domainIncludes: Demand
rangeIncludes: Person
rangeIncludes: Organization
sub property of: participant
sub property of: hasSupplier
equivalent property: Seller
comment: An entity which offers (sells / leases / lends / loans) the services / goods. A seller may also be a provider.

artMedium
type: Property
sub property of: material
rangeIncludes: URL
rangeIncludes: Text
domainIncludes: VisualArtwork
comment: The material used. (E.g. Oil, Watercolour, Acrylic, Linoprint, Marble, Cyanotype, Digital, Lithograph, DryPoint, Intaglio, Pastel, Woodcut, Pencil, Mixed Media, etc.)

material
type: Property
rangeIncludes: Product
rangeIncludes: URL
rangeIncludes: Text
comment: A material that something is made from, e.g. leather, wool, cotton, paper.
domainIncludes: CreativeWork
domainIncludes: Product

valueReference
type: Property
rangeIncludes: StructuredValue
rangeIncludes: DefinedTerm
rangeIncludes: PropertyValue
rangeIncludes: QuantitativeValue
rangeIncludes: Enumeration
rangeIncludes: MeasurementTypeEnumeration
rangeIncludes: Text
rangeIncludes: QualitativeValue
domainIncludes: PropertyValue
domainIncludes: QuantitativeValue
domainIncludes: QualitativeValue
comment: A secondary value that provides additional information on the original value, e.g. a reference temperature or a type of measurement.
contributor: GoodRelationsTerms

SubscribeAction
type: Class
comment: The act of forming a personal connection with someone/something (object) unidirectionally/asymmetrically to get updates pushed to.\n\nRelated actions:\n\n* FollowAction: Unlike FollowAction, SubscribeAction implies that the subscriber acts as a passive agent being constantly/actively pushed for updates.\n* RegisterAction: Unlike RegisterAction, SubscribeAction implies that the agent is interested in continuing receiving updates from the object.\n* JoinAction: Unlike JoinAction, SubscribeAction implies that the agent is interested in continuing receiving updates from the object.
subclass of: InteractAction

healthCondition
type: Property
domainIncludes: PeopleAudience
domainIncludes: Patient
domainIncludes: MedicalStudy
rangeIncludes: MedicalCondition
isPartOf: health-lifesci.schema.org
comment: Specifying the health condition(s) of a patient, medical study, or other target audience.

SingleRelease
type: MusicAlbumReleaseType
comment: SingleRelease.
contributor: MBZ

DefinitiveLegalValue
type: LegalValueLevel
isPartOf: pending.schema.org
source: https://github.com/schemaorg/schemaorg/issues/1156
source: eli
comment: Indicates a document for which the text is conclusively what the law says and is legally binding. (e.g. The digitally signed version of an Official Journal.) Something "Definitive" is considered to be also AuthoritativeLegalValue.
contributor: ELI

accountId
type: Property
sub property of: identifier
comment: The identifier for the account the payment will be applied to.
domainIncludes: Invoice
rangeIncludes: Text

depth
type: Property
domainIncludes: OfferShippingDetails
domainIncludes: VisualArtwork
domainIncludes: ShippingConditions
domainIncludes: Product
rangeIncludes: Distance
rangeIncludes: QuantitativeValue
comment: The depth of the item.
contributor: GoodRelationsTerms
source: https://github.com/schemaorg/schemaorg/issues/3617

homeTeam
type: Property
domainIncludes: SportsEvent
rangeIncludes: Person
rangeIncludes: SportsTeam
comment: The home team in a sports event.
sub property of: competitor

competitor
type: Property
comment: A competitor in a sports event.
rangeIncludes: Person
rangeIncludes: SportsTeam
domainIncludes: SportsEvent

isAcceptingNewPatients
type: Property
source: https://github.com/schemaorg/schemaorg/issues/1062
rangeIncludes: Boolean
domainIncludes: MedicalOrganization
comment: Whether the provider is accepting new patients.
isPartOf: pending.schema.org

observationPeriod
type: Property
source: https://github.com/schemaorg/schemaorg/issues/2564
domainIncludes: Observation
comment: The length of time an Observation took place over. The format follows `P[0-9]*[Y|M|D|h|m|s]`. For example, P1Y is Period 1 Year, P3M is Period 3 Months, P3h is Period 3 hours.
rangeIncludes: Text
isPartOf: pending.schema.org

UKTrust
type: UKNonprofitType
comment: UKTrust: Non-profit type referring to a UK trust.
source: https://github.com/schemaorg/schemaorg/issues/2543
isPartOf: pending.schema.org

applicationStartDate
type: Property
comment: The date at which the program begins collecting applications for the next enrollment cycle.
domainIncludes: EducationalOccupationalProgram
isPartOf: pending.schema.org
rangeIncludes: Date
source: https://github.com/schemaorg/schemaorg/issues/2419

Zoo
type: Class
comment: A zoo.
subclass of: CivicStructure

applicationDeadline
type: Property
domainIncludes: EducationalOccupationalProgram
comment: The date on which the program stops collecting applications for the next enrollment cycle. Flexible application deadlines (for example, a program with rolling admissions) can be described in a textual string, rather than as a DateTime.
isPartOf: pending.schema.org
rangeIncludes: Date
rangeIncludes: Text
source: https://github.com/schemaorg/schemaorg/issues/2419

isRelatedTo
type: Property
equivalent property: RelatedProduct
domainIncludes: Service
domainIncludes: Product
rangeIncludes: Service
rangeIncludes: Product
contributor: GoodRelationsTerms
comment: A pointer to another, somehow related product (or multiple products).

Nonprofit501c25
type: USNonprofitType
source: https://github.com/schemaorg/schemaorg/issues/2543
comment: Nonprofit501c25: Non-profit type referring to Real Property Title-Holding Corporations or Trusts with Multiple Parents.
isPartOf: pending.schema.org

BodyMeasurementChest
type: BodyMeasurementTypeEnumeration
source: https://github.com/schemaorg/schemaorg/issues/2811
isPartOf: pending.schema.org
comment: Maximum girth of chest. Used, for example, to fit men's suits.

numberOfAirbags
type: Property
rangeIncludes: Number
rangeIncludes: Text
comment: The number or type of airbags in the vehicle.
contributor: Automotive Ontology Working Group
domainIncludes: Vehicle

Nonprofit501f
type: USNonprofitType
source: https://github.com/schemaorg/schemaorg/issues/2543
isPartOf: pending.schema.org
comment: Nonprofit501f: Non-profit type referring to Cooperative Service Organizations.

geoContains
type: Property
rangeIncludes: Place
rangeIncludes: GeospatialGeometry
domainIncludes: GeospatialGeometry
domainIncludes: Place
comment: Represents a relationship between two geometries (or the places they represent), relating a containing geometry to a contained geometry. "a contains b iff no points of b lie in the exterior of a, and at least one point of the interior of b lies in the interior of a". As defined in [DE-9IM](https://en.wikipedia.org/wiki/DE-9IM).

WearableSizeSystemContinental
type: WearableSizeSystemEnumeration
comment: Continental size system for wearables.
source: https://github.com/schemaorg/schemaorg/issues/2811
isPartOf: pending.schema.org

musicalKey
type: Property
contributor: MBZ
comment: The key, mode, or scale this composition uses.
domainIncludes: MusicComposition
rangeIncludes: Text

AuthoritativeLegalValue
type: LegalValueLevel
source: eli
source: https://github.com/schemaorg/schemaorg/issues/1156
comment: Indicates that the publisher gives some special status to the publication of the document. ("The Queens Printer" version of a UK Act of Parliament, or the PDF version of a Directive published by the EU Office of Publications). Something "Authoritative" is considered to be also OfficialLegalValue".
isPartOf: pending.schema.org
contributor: ELI

branchOf
type: Property
supersededBy: parentOrganization
domainIncludes: LocalBusiness
rangeIncludes: Organization
comment: The larger organization that this local business is a branch of, if any. Not to be confused with (anatomical) branch.

parentOrganization
type: Property
equivalent property: parentOrganization
domainIncludes: Organization
inverseOf: subOrganization
rangeIncludes: Organization
comment: The larger organization that this organization is a subOrganization of, if any.

toLocation
type: Property
domainIncludes: MoveAction
domainIncludes: ExerciseAction
domainIncludes: TransferAction
domainIncludes: InsertAction
comment: A sub property of location. The final location of the object or the agent after the action.
rangeIncludes: Place
sub property of: location

location
type: Property
domainIncludes: Action
domainIncludes: Event
domainIncludes: Organization
domainIncludes: InteractionCounter
rangeIncludes: Text
rangeIncludes: VirtualLocation
rangeIncludes: Place
rangeIncludes: PostalAddress
equivalent property: isLocatedIn
comment: The location of, for example, where an event is happening, where an organization is located, or where an action takes place.

DanceEvent
type: Class
subclass of: Event
comment: Event type: A social dance.

identifyingTest
type: Property
isPartOf: health-lifesci.schema.org
rangeIncludes: MedicalTest
domainIncludes: MedicalSign
comment: A diagnostic test that can identify this sign.

healthPlanCostSharing
type: Property
isPartOf: pending.schema.org
rangeIncludes: HealthPlanCostSharingSpecification
rangeIncludes: Boolean
source: https://github.com/schemaorg/schemaorg/issues/1062
domainIncludes: HealthPlanFormulary
domainIncludes: HealthPlanNetwork
comment: The costs to the patient for services under this network or formulary.

slogan
type: Property
equivalent property: PromotionalMessage
rangeIncludes: Text
domainIncludes: Brand
domainIncludes: Product
domainIncludes: Place
domainIncludes: Service
domainIncludes: Organization
comment: A slogan or motto associated with the item.

legislationDate
type: Property
comment: The date of adoption or signature of the legislation. This is the date at which the text is officially aknowledged to be a legislation, even though it might not even be published or in force.
source: https://github.com/schemaorg/schemaorg/issues/1156
source: eli
rangeIncludes: Date
domainIncludes: Legislation
contributor: ELI
isPartOf: pending.schema.org
equivalent property: date document
sub property of: dateCreated

dateCreated
type: Property
rangeIncludes: DateTime
rangeIncludes: Date
domainIncludes: DataFeedItem
domainIncludes: CreativeWork
comment: The date on which the CreativeWork was created or the item was added to a DataFeed.

WearableSizeSystemUK
type: WearableSizeSystemEnumeration
comment: United Kingdom size system for wearables.
isPartOf: pending.schema.org
source: https://github.com/schemaorg/schemaorg/issues/2811

SatiricalArticle
type: Class
subclass of: Article
source: https://github.com/schemaorg/schemaorg/issues/1525
comment: An Article whose content is primarily satirical(https://en.wikipedia.org/wiki/Satire) in nature, i.e. unlikely to be literally true. A satirical article is sometimes but not necessarily also a NewsArticle. ScholarlyArticles are also sometimes satirized.
contributor: TP
isPartOf: pending.schema.org

MusicVideoObject
type: Class
subclass of: MediaObject
comment: A music video file.

ticketNumber
type: Property
comment: The unique identifier for the ticket.
rangeIncludes: Text
domainIncludes: Ticket

occupationalCredentialAwarded
type: Property
rangeIncludes: EducationalOccupationalCredential
rangeIncludes: URL
rangeIncludes: Text
source: https://github.com/schemaorg/schemaorg/issues/2289
domainIncludes: Course
domainIncludes: EducationalOccupationalProgram
comment: A description of the qualification, award, certificate, diploma or other occupational credential awarded as a consequence of successful completion of this course or program.
isPartOf: pending.schema.org

chemicalRole
type: Property
domainIncludes: MolecularEntity
domainIncludes: ChemicalSubstance
comment: A role played by the BioChemEntity within a chemical context.
isPartOf: pending.schema.org
rangeIncludes: DefinedTerm
source: ChemicalSubstance

hasPOS
type: Property
rangeIncludes: Place
domainIncludes: Person
domainIncludes: Organization
contributor: GoodRelationsTerms
comment: Points-of-Sales operated by the organization or person.

maximumPhysicalAttendeeCapacity
type: Property
comment: The maximum physical attendee capacity of an Event whose eventAttendanceMode is OfflineEventAttendanceMode (or the offline aspects, in the case of a MixedEventAttendanceMode).
source: https://github.com/schemaorg/schemaorg/issues/1842
domainIncludes: Event
rangeIncludes: Integer
isPartOf: pending.schema.org

Code
type: Class
subclass of: CreativeWork
supersededBy: SoftwareSourceCode
comment: Computer programming source code. Example: Full (compile ready) solutions, code snippet samples, scripts, templates.

checkoutPageURLTemplate
type: Property
comment: A URL template (RFC 6570) for a checkout page for an offer. This approach allows merchants to specify a URL for online checkout of the offered product, by interpolating parameters such as the logged in user ID, product ID, quantity, discount code etc. Parameter naming and standardization are not specified here.
source: https://github.com/schemaorg/schemaorg/issues/3135
rangeIncludes: Text
isPartOf: pending.schema.org
domainIncludes: Offer

clincalPharmacology
type: Property
isPartOf: health-lifesci.schema.org
domainIncludes: Drug
comment: Description of the absorption and elimination of drugs, including their concentration (pharmacokinetics, pK) and biological effects (pharmacodynamics, pD).
supersededBy: clinicalPharmacology
rangeIncludes: Text

clinicalPharmacology
type: Property
comment: Description of the absorption and elimination of drugs, including their concentration (pharmacokinetics, pK) and biological effects (pharmacodynamics, pD).
isPartOf: health-lifesci.schema.org
rangeIncludes: Text
domainIncludes: Drug

numberOfCredits
type: Property
source: https://github.com/schemaorg/schemaorg/issues/2419
domainIncludes: EducationalOccupationalProgram
domainIncludes: Course
comment: The number of credits or units awarded by a Course or required to complete an EducationalOccupationalProgram.
rangeIncludes: StructuredValue
rangeIncludes: Integer
isPartOf: pending.schema.org

vehicleModelDate
type: Property
rangeIncludes: Date
domainIncludes: Vehicle
comment: The release date of a vehicle model (often used to differentiate versions of the same make and model).
contributor: Automotive Ontology Working Group

layoutImage
type: Property
isPartOf: pending.schema.org
rangeIncludes: ImageObject
rangeIncludes: URL
source: https://github.com/schemaorg/schemaorg/issues/2690
domainIncludes: FloorPlan
sub property of: image
comment: A schematic image showing the floorplan layout.

image
type: Property
domainIncludes: Thing
rangeIncludes: ImageObject
rangeIncludes: URL
comment: An image of the item. This can be a URL or a fully described ImageObject.

educationalLevel
type: Property
domainIncludes: CreativeWork
domainIncludes: LearningResource
domainIncludes: EducationEvent
domainIncludes: EducationalOccupationalCredential
isPartOf: pending.schema.org
source: https://github.com/schemaorg/schemaorg/issues/1779
rangeIncludes: DefinedTerm
rangeIncludes: URL
rangeIncludes: Text
comment: The level in terms of progression through an educational or training context. Examples of educational levels include 'beginner', 'intermediate' or 'advanced', and formal sets of level indicators.

geoCrosses
type: Property
domainIncludes: Place
domainIncludes: GeospatialGeometry
rangeIncludes: Place
rangeIncludes: GeospatialGeometry
comment: Represents a relationship between two geometries (or the places they represent), relating a geometry to another that crosses it: "a crosses b: they have some but not all interior points in common, and the dimension of the intersection is less than that of at least one of them". As defined in [DE-9IM](https://en.wikipedia.org/wiki/DE-9IM).

grantee
type: Property
rangeIncludes: Audience
rangeIncludes: ContactPoint
rangeIncludes: Person
rangeIncludes: Organization
domainIncludes: DigitalDocumentPermission
comment: The person, organization, contact point, or audience that has been granted this permission.

Paperback
type: BookFormatType
comment: A flexible, lightweight book bound with a thick paper or cardstock cover and glued spine, prioritizing portability and affordability over long-term durability.

reviewedBy
type: Property
rangeIncludes: Person
rangeIncludes: Organization
domainIncludes: WebPage
comment: People or organizations that have reviewed the content on this web page for accuracy and/or completeness.

WearableSizeSystemDE
type: WearableSizeSystemEnumeration
isPartOf: pending.schema.org
source: https://github.com/schemaorg/schemaorg/issues/2811
comment: German size system for wearables.

differentialDiagnosis
type: Property
rangeIncludes: DDxElement
comment: One of a set of differential diagnoses for the condition. Specifically, a closely-related or competing diagnosis typically considered later in the cognitive process whereby this medical condition is distinguished from others most likely responsible for a similar collection of signs and symptoms to reach the most parsimonious diagnosis or diagnoses in a patient.
isPartOf: health-lifesci.schema.org
domainIncludes: MedicalCondition

cvdNumC19OverflowPats
type: Property
source: https://github.com/schemaorg/schemaorg/issues/2521
rangeIncludes: Number
comment: numc19overflowpats - ED/OVERFLOW: Patients with suspected or confirmed COVID-19 who are in the ED or any overflow location awaiting an inpatient bed.
domainIncludes: CDCPMDRecord
isPartOf: pending.schema.org

email
type: Property
domainIncludes: ContactPoint
domainIncludes: Person
domainIncludes: Organization
equivalent property: email
comment: Email address.
rangeIncludes: Text

hostingOrganization
type: Property
domainIncludes: MemberProgram
domainIncludes: ProgramMembership
comment: The Organization (airline, travelers' club, retailer, etc.) the membership is made with or which offers the MemberProgram.
rangeIncludes: Organization

iswcCode
type: Property
domainIncludes: MusicComposition
contributor: MBZ
comment: The International Standard Musical Work Code for the composition.
rangeIncludes: Text

recipeInstructions
type: Property
sub property of: step
domainIncludes: Recipe
rangeIncludes: CreativeWork
rangeIncludes: ItemList
rangeIncludes: Text
comment: A step in making the recipe, in the form of a single item (document, video, etc.) or an ordered list with HowToStep and/or HowToSection items.

step
type: Property
comment: A single step item (as HowToStep, text, document, video, etc.) or a HowToSection.
domainIncludes: HowTo
rangeIncludes: Text
rangeIncludes: HowToStep
rangeIncludes: HowToSection
rangeIncludes: CreativeWork

UnclassifiedAdultConsideration
type: AdultOrientedEnumeration
source: https://github.com/schemaorg/schemaorg/issues/2989
isPartOf: pending.schema.org
comment: The item is suitable only for adults, without indicating why. Due to widespread use of "adult" as a euphemism for "sexual", many such items are likely suited also for the SexualContentConsideration code.

RadioSeason
type: Class
subclass of: CreativeWorkSeason
comment: Season dedicated to radio broadcast and associated online delivery.

sampleType
type: Property
comment: What type of code sample: full (compile ready) solution, code snippet, inline code, scripts, template.
supersededBy: codeSampleType
rangeIncludes: Text
domainIncludes: SoftwareSourceCode

codeSampleType
type: Property
rangeIncludes: Text
domainIncludes: SoftwareSourceCode
comment: What type of code sample: full (compile ready) solution, code snippet, inline code, scripts, template.

sport
type: Property
domainIncludes: SportsOrganization
domainIncludes: SportsEvent
rangeIncludes: Text
rangeIncludes: URL
source: https://github.com/schemaorg/schemaorg/issues/1951
isPartOf: pending.schema.org
comment: A type of sport (e.g. Baseball).

currentExchangeRate
type: Property
domainIncludes: ExchangeRateSpecification
source: https://github.com/schemaorg/schemaorg/issues/1253
comment: The current price of a currency.
rangeIncludes: UnitPriceSpecification
contributor: FIBO
isPartOf: pending.schema.org

wordCount
type: Property
domainIncludes: CreativeWork
domainIncludes: Article
comment: The number of words in the text of the CreativeWork such as an Article, Book, etc.
rangeIncludes: Integer

SizeSystemImperial
type: SizeSystemEnumeration
source: https://github.com/schemaorg/schemaorg/issues/2811
isPartOf: pending.schema.org
comment: Imperial size system.

isLocatedInSubcellularLocation
type: Property
domainIncludes: BioChemEntity
isPartOf: pending.schema.org
rangeIncludes: DefinedTerm
rangeIncludes: URL
rangeIncludes: PropertyValue
comment: Subcellular location where this BioChemEntity is located; please use PropertyValue if you want to include any evidence.
source: BioChemEntity

vehicleIdentificationNumber
type: Property
contributor: Automotive Ontology Working Group
domainIncludes: Vehicle
sub property of: serialNumber
rangeIncludes: Text
comment: The Vehicle Identification Number (VIN) is a unique serial number used by the automotive industry to identify individual motor vehicles.

serialNumber
type: Property
comment: The serial number or any alphanumeric identifier of a particular product. When attached to an offer, it is a shortcut for the serial number of the product included in the offer.
domainIncludes: IndividualProduct
domainIncludes: Demand
domainIncludes: Offer
rangeIncludes: Text
sub property of: identifier
contributor: GoodRelationsTerms
equivalent property: SerialId

AuthenticateAction
type: Class
source: https://github.com/schemaorg/schemaorg/issues/4507
isPartOf: pending.schema.org
comment: The action of authenticating into a device or application.
subclass of: ControlAction

UserDownloads
type: Class
subclass of: UserInteraction
comment: UserInteraction and its subtypes is an old way of talking about users interacting with pages. It is generally better to use Action-based vocabulary, alongside types such as Comment.
supersededBy: InteractionCounter

GenericWebPlatform
type: DigitalPlatformEnumeration
source: https://github.com/schemaorg/schemaorg/issues/3057
comment: Represents the generic notion of the Web Platform. More specific codes include MobileWebPlatform and DesktopWebPlatform, as an incomplete list.
isPartOf: pending.schema.org

rsvpResponse
type: Property
comment: The response (yes, no, maybe) to the RSVP.
domainIncludes: RsvpAction
rangeIncludes: RsvpResponseType

numberOfForwardGears
type: Property
comment: The total number of forward gears available for the transmission system of the vehicle.\n\nTypical unit code(s): C62.
rangeIncludes: Number
rangeIncludes: QuantitativeValue
domainIncludes: Vehicle
contributor: Automotive Ontology Working Group

Campground
type: Class
comment: A camping site, campsite, or Campground is a place used for overnight stay in the outdoors, typically containing individual CampingPitch locations. \n\n In British English a campsite is an area, usually divided into a number of pitches, where people can camp overnight using tents or camper vans or caravans; this British English use of the word is synonymous with the American English expression campground. In American English the term campsite generally means an area where an individual, family, group, or military unit can pitch a tent or park a camper; a campground may contain many campsites (source: Wikipedia, see [https://en.wikipedia.org/wiki/Campsite](https://en.wikipedia.org/wiki/Campsite)).\n\n See also the dedicated [document on the use of schema.org for marking up hotels and other forms of accommodations](/docs/hotels.html).
subclass of: CivicStructure
subclass of: LodgingBusiness
contributor: STI Accommodation Ontology

reservationFor
type: Property
comment: The thing -- flight, event, restaurant, etc. being reserved.
rangeIncludes: Thing
domainIncludes: Reservation

OriginalMediaContent
type: MediaManipulationRatingEnumeration
source: https://github.com/schemaorg/schemaorg/issues/2450
isPartOf: pending.schema.org
comment: Content coded 'as original media content' in a MediaReview, considered in the context of how it was published or shared. For a VideoObject to be 'original': No evidence the footage has been misleadingly altered or manipulated, though it may contain false or misleading claims. For an ImageObject to be 'original': No evidence the image has been misleadingly altered or manipulated, though it may still contain false or misleading claims. For an ImageObject with embedded text to be 'original': No evidence the image has been misleadingly altered or manipulated, though it may still contain false or misleading claims. For an AudioObject to be 'original': No evidence the audio has been misleadingly altered or manipulated, though it may contain false or misleading claims.

PublicHealth
type: MedicalSpecialty
subclass of: MedicalBusiness
isPartOf: health-lifesci.schema.org
comment: Branch of medicine that pertains to the health services to improve and protect community health, especially epidemiology, sanitation, immunization, and preventive medicine.

TrainReservation
type: Class
comment: A reservation for train travel.\n\nNote: This type is for information about actual reservations, e.g. in confirmation emails or HTML pages with individual confirmations of reservations. For offers of tickets, use Offer.
subclass of: Reservation

nerve
type: Property
comment: The underlying innervation associated with the muscle.
domainIncludes: Muscle
rangeIncludes: Nerve
isPartOf: health-lifesci.schema.org

gameEdition
type: Property
comment: The edition of a video game.
rangeIncludes: Text
domainIncludes: VideoGame

sharedContent
type: Property
domainIncludes: Comment
domainIncludes: SocialMediaPosting
comment: A CreativeWork such as an image, video, or audio clip shared as part of this posting.
rangeIncludes: CreativeWork

BloodTest
type: Class
isPartOf: health-lifesci.schema.org
comment: A medical test performed on a sample of a patient's blood.
subclass of: MedicalTest

cvdNumC19HOPats
type: Property
source: https://github.com/schemaorg/schemaorg/issues/2521
rangeIncludes: Number
comment: numc19hopats - HOSPITAL ONSET: Patients hospitalized in an NHSN inpatient care location with onset of suspected or confirmed COVID-19 14 or more days after hospitalization.
isPartOf: pending.schema.org
domainIncludes: CDCPMDRecord

enginePower
type: Property
rangeIncludes: QuantitativeValue
comment: The power of the vehicle's engine. Typical unit code(s): KWT for kilowatt, BHP for brake horsepower, N12 for metric horsepower (PS, with 1 PS = 735,49875 W)\n\n* Note 1: There are many different ways of measuring an engine's power. For an overview, see [http://en.wikipedia.org/wiki/Horsepower#Engine\_power\_test\_codes](http://en.wikipedia.org/wiki/Horsepower#Engine_power_test_codes).\n* Note 2: You can link to information about how the given value has been determined using the valueReference property.\n* Note 3: You can use minValue and maxValue to indicate ranges.
isPartOf: auto.schema.org
domainIncludes: EngineSpecification
contributor: Automotive Ontology Working Group

photos
type: Property
supersededBy: photo
domainIncludes: Place
comment: Photographs of this place.
rangeIncludes: Photograph
rangeIncludes: ImageObject

photo
type: Property
comment: A photograph of this place.
sub property of: image
domainIncludes: Place
rangeIncludes: Photograph
rangeIncludes: ImageObject

seatingCapacity
type: Property
comment: The number of persons that can be seated (e.g. in a vehicle), both in terms of the physical space available, and in terms of limitations set by law.\n\nTypical unit code(s): C62 for persons.
isPartOf: auto.schema.org
contributor: Automotive Ontology Working Group
rangeIncludes: QuantitativeValue
rangeIncludes: Number
domainIncludes: Vehicle

publisherImprint
type: Property
isPartOf: bib.schema.org
domainIncludes: CreativeWork
rangeIncludes: Organization
comment: The publishing division which published the comic.

expires
type: Property
domainIncludes: Certification
domainIncludes: CreativeWork
rangeIncludes: DateTime
rangeIncludes: Date
comment: Date the content expires and is no longer useful or available. For example a VideoObject or NewsArticle whose availability or relevance is time-limited, a ClaimReview fact check whose publisher wants to indicate that it may no longer be relevant (or helpful to highlight) after some date, or a Certification the validity has expired.

elevation
type: Property
domainIncludes: GeoShape
domainIncludes: GeoCoordinates
comment: The elevation of a location ([WGS 84](https://en.wikipedia.org/wiki/World_Geodetic_System)). Values may be of the form 'NUMBER UNIT\_OF\_MEASUREMENT' (e.g., '1,000 m', '3,200 ft') while numbers alone should be assumed to be a value in meters.
rangeIncludes: Number
rangeIncludes: Text

PrescriptionOnly
type: DrugPrescriptionStatus
isPartOf: health-lifesci.schema.org
comment: Available by prescription only.

worstRating
type: Property
comment: The lowest value allowed in this rating system.
rangeIncludes: Text
rangeIncludes: Number
domainIncludes: Rating

textValue
type: Property
isPartOf: pending.schema.org
rangeIncludes: Text
domainIncludes: PronounceableText
comment: Text value being annotated.
source: https://github.com/schemaorg/schemaorg/issues/2108

Dentist
type: Class
comment: A dentist.
subclass of: LocalBusiness
subclass of: MedicalOrganization
subclass of: MedicalBusiness

foundingLocation
type: Property
comment: The place where the Organization was founded.
rangeIncludes: Place
domainIncludes: Organization

Retail
type: DrugCostCategory
isPartOf: health-lifesci.schema.org
comment: The drug's cost represents the retail cost of the drug.

penciler
type: Property
domainIncludes: ComicStory
domainIncludes: VisualArtwork
domainIncludes: ComicIssue
rangeIncludes: Person
isPartOf: bib.schema.org
comment: The individual who draws the primary narrative artwork.

hasTierRequirement
type: Property
source: https://github.com/schemaorg/schemaorg/issues/3563
domainIncludes: MemberProgramTier
rangeIncludes: MonetaryAmount
rangeIncludes: Text
rangeIncludes: CreditCard
rangeIncludes: UnitPriceSpecification
comment: A requirement for a user to join a membership tier, for example: a CreditCard if the tier requires sign up for a credit card, A UnitPriceSpecification if the user is required to pay a (periodic) fee, or a MonetaryAmount if the user needs to spend a minimum amount to join the tier. If a tier is free to join then this property does not need to be specified.

availableLanguage
type: Property
domainIncludes: LodgingBusiness
domainIncludes: TouristAttraction
domainIncludes: ServiceChannel
domainIncludes: ContactPoint
domainIncludes: Course
equivalent property: availableLanguage
rangeIncludes: Language
rangeIncludes: Text
comment: A language someone may use with or at the item, service or place. Please use one of the language codes from the [IETF BCP 47 standard](http://tools.ietf.org/html/bcp47). See also inLanguage.

contactPoints
type: Property
domainIncludes: Organization
domainIncludes: Person
rangeIncludes: ContactPoint
comment: A contact point for a person or organization.
supersededBy: contactPoint
equivalent property: hasContactPoint

contactPoint
type: Property
domainIncludes: HealthInsurancePlan
domainIncludes: Organization
domainIncludes: Person
comment: A contact point for a person or organization.
rangeIncludes: ContactPoint

strengthValue
type: Property
isPartOf: health-lifesci.schema.org
rangeIncludes: Number
comment: The value of an active ingredient's strength, e.g. 325.
domainIncludes: DrugStrength

arrivalPlatform
type: Property
rangeIncludes: Text
domainIncludes: TrainTrip
comment: The platform where the train arrives.

eligibleDuration
type: Property
contributor: GoodRelationsTerms
rangeIncludes: QuantitativeValue
comment: The duration for which the given offer is valid.
domainIncludes: Demand
domainIncludes: Offer

BodyMeasurementHead
type: BodyMeasurementTypeEnumeration
isPartOf: pending.schema.org
source: https://github.com/schemaorg/schemaorg/issues/2811
comment: Maximum girth of head above the ears. Used, for example, to fit hats.

Mosque
type: Class
subclass of: PlaceOfWorship
comment: A mosque.

dietFeatures
type: Property
isPartOf: health-lifesci.schema.org
domainIncludes: Diet
comment: Nutritional information specific to the dietary plan. May include dietary recommendations on what foods to avoid, what foods to consume, and specific alterations/deviations from the USDA or other regulatory body's approved dietary guidelines.
rangeIncludes: Text

legislationCountersignedBy
type: Property
rangeIncludes: Person
rangeIncludes: Organization
source: eli
source: https://github.com/schemaorg/schemaorg/issues/2698
contributor: ELI
equivalent property: countersigned by
domainIncludes: Legislation
isPartOf: pending.schema.org
comment: The person or organization that countersigned the legislation. Depending on the legal context, a countersignature can indicate that the signed authority undertakes to assume responsibility for texts emanating from a person who is inviolable and irresponsible, (for example a King, Grand Duc or President), or that the authority is in charge of the implementation of the text.

postalCodeEnd
type: Property
source: https://github.com/schemaorg/schemaorg/issues/2506
comment: Last postal code in the range (included). Needs to be after postalCodeBegin.
rangeIncludes: Text
domainIncludes: PostalCodeRangeSpecification
sub property of: hasUpperBound

PaintAction
type: Class
comment: The act of producing a painting, typically with paint and canvas as instruments.
subclass of: CreateAction

intensity
type: Property
domainIncludes: ExercisePlan
rangeIncludes: QuantitativeValue
rangeIncludes: Text
comment: Quantitative measure gauging the degree of force involved in the exercise, for example, heartbeats per minute. May include the velocity of the movement.
isPartOf: health-lifesci.schema.org

PET
type: MedicalImagingTechnique
isPartOf: health-lifesci.schema.org
comment: Positron emission tomography imaging.

epidemiology
type: Property
isPartOf: health-lifesci.schema.org
domainIncludes: PhysicalActivity
domainIncludes: MedicalCondition
comment: The characteristics of associated patients, such as age, gender, race etc.
rangeIncludes: Text

constraintProperty
type: Property
comment: Indicates a property used as a constraint. For example, in the definition of a StatisticalVariable. The value is a property, either from within Schema.org or from other compatible (e.g. RDF) systems such as DataCommons.org or Wikidata.org.
rangeIncludes: URL
rangeIncludes: Property
isPartOf: pending.schema.org
domainIncludes: ConstraintNode
source: https://github.com/schemaorg/schemaorg/issues/2291

bodyType
type: Property
domainIncludes: Vehicle
isPartOf: auto.schema.org
rangeIncludes: Text
rangeIncludes: QualitativeValue
rangeIncludes: URL
contributor: Automotive Ontology Working Group
comment: Indicates the design and body style of the vehicle (e.g. station wagon, hatchback, etc.).

TattooParlor
type: Class
comment: A tattoo parlor.
subclass of: HealthAndBeautyBusiness

LakeBodyOfWater
type: Class
comment: A lake (for example, Lake Pontrachain).
subclass of: BodyOfWater

hasCategoryCode
type: Property
comment: A Category code contained in this code set.
source: https://github.com/schemaorg/schemaorg/issues/894
isPartOf: pending.schema.org
sub property of: hasDefinedTerm
rangeIncludes: CategoryCode
domainIncludes: CategoryCodeSet

hasDefinedTerm
type: Property
rangeIncludes: DefinedTerm
source: https://github.com/schemaorg/schemaorg/issues/894
domainIncludes: DefinedTermSet
domainIncludes: Taxon
comment: A Defined Term contained in this term set.
isPartOf: pending.schema.org

Cardiovascular
type: MedicalSpecialty
isPartOf: health-lifesci.schema.org
comment: A specific branch of medical science that pertains to diagnosis and treatment of disorders of heart and vasculature.

seeks
type: Property
contributor: GoodRelationsTerms
rangeIncludes: Demand
domainIncludes: Person
domainIncludes: Organization
comment: A pointer to products or services sought by the organization or person (demand).

OfficeEquipmentStore
type: Class
comment: An office equipment store.
subclass of: Store

aggregateElement
type: Property
domainIncludes: ItemList
comment: Indicates a prototype of the elements in the list that is used to hold aggregate information (ratings, offers, etc.).
isPartOf: pending.schema.org
rangeIncludes: Thing
source: https://github.com/schemaorg/schemaorg/issues/4321

smokingAllowed
type: Property
comment: Indicates whether it is allowed to smoke in the place, e.g. in the restaurant, hotel or hotel room.
rangeIncludes: Boolean
contributor: STI Accommodation Ontology
domainIncludes: Place

tool
type: Property
comment: A sub property of instrument. An object used (but not consumed) when performing instructions or a direction.
sub property of: instrument
rangeIncludes: HowToTool
rangeIncludes: Text
domainIncludes: HowToDirection
domainIncludes: HowTo

securityClearanceRequirement
type: Property
domainIncludes: JobPosting
rangeIncludes: Text
rangeIncludes: URL
isPartOf: pending.schema.org
source: https://github.com/schemaorg/schemaorg/issues/2384
comment: A description of any security clearance requirements of the job.

occupancy
type: Property
contributor: STI Accommodation Ontology
domainIncludes: Accommodation
domainIncludes: Suite
domainIncludes: SingleFamilyResidence
domainIncludes: HotelRoom
domainIncludes: Apartment
rangeIncludes: QuantitativeValue
comment: The allowed total occupancy for the accommodation in persons (including infants etc). For individual accommodations, this is not necessarily the legal maximum but defines the permitted usage as per the contractual agreement (e.g. a double room used by a single person). Typical unit code(s): C62 for person.

AmpStory
type: Class
isPartOf: pending.schema.org
comment: A creative work with a visual storytelling format intended to be viewed online, particularly on mobile devices.
source: https://github.com/schemaorg/schemaorg/issues/2646
subclass of: CreativeWork
subclass of: MediaObject

PoliticalParty
type: Class
comment: Organization: Political Party.
subclass of: Organization
source: https://github.com/schemaorg/schemaorg/issues/3282

hoursAvailable
type: Property
comment: The hours during which this service or contact is available.
rangeIncludes: OpeningHoursSpecification
domainIncludes: LocationFeatureSpecification
domainIncludes: Service
domainIncludes: ContactPoint

hasBioPolymerSequence
type: Property
sub property of: hasRepresentation
isPartOf: pending.schema.org
domainIncludes: Gene
domainIncludes: Protein
source: Gene
rangeIncludes: Text
comment: A symbolic representation of a BioChemEntity. For example, a nucleotide sequence of a Gene or an amino acid sequence of a Protein.

additionalType
type: Property
rangeIncludes: URL
rangeIncludes: Text
domainIncludes: Thing
sub property of: type
comment: An additional type for the item, typically used for adding more specific types from external vocabularies in microdata syntax. This is a relationship between something and a class that the thing is in. Typically the value is a URI-identified RDF class, and in this case corresponds to the use of rdf:type in RDF. Text values can be used sparingly, for cases where useful information can be added without their being an appropriate schema to reference. In the case of text values, the class label should follow the schema.org style guide.

catalog
type: Property
supersededBy: includedInDataCatalog
comment: A data catalog which contains this dataset.
rangeIncludes: DataCatalog
domainIncludes: Dataset

includedInDataCatalog
type: Property
comment: A data catalog which contains this dataset.
rangeIncludes: DataCatalog
domainIncludes: Dataset
inverseOf: dataset

DiagnosticProcedure
type: Class
isPartOf: health-lifesci.schema.org
comment: A medical procedure intended primarily for diagnostic, as opposed to therapeutic, purposes.
subclass of: MedicalProcedure

Terminated
type: MedicalStudyStatus
comment: Terminated.
isPartOf: health-lifesci.schema.org

benefits
type: Property
domainIncludes: JobPosting
rangeIncludes: Text
supersededBy: jobBenefits
comment: Description of benefits associated with the job.

jobBenefits
type: Property
domainIncludes: JobPosting
rangeIncludes: Text
comment: Description of benefits associated with the job.

duringMedia
type: Property
comment: A media object representing the circumstances while performing this direction.
domainIncludes: HowToDirection
rangeIncludes: MediaObject
rangeIncludes: URL

UsageOrScheduleHealthAspect
type: HealthAspectEnumeration
source: https://github.com/schemaorg/schemaorg/issues/2374
isPartOf: pending.schema.org
comment: Content about how, when, frequency and dosage of a topic.

WearableSizeGroupShort
type: WearableSizeGroupEnumeration
isPartOf: pending.schema.org
comment: Size group "Short" for wearables.
source: https://github.com/schemaorg/schemaorg/issues/2811

structuralClass
type: Property
isPartOf: health-lifesci.schema.org
rangeIncludes: Text
comment: The name given to how bone physically connects to each other.
domainIncludes: Joint

BikeStore
type: Class
subclass of: Store
comment: A bike store.

publicAccess
type: Property
rangeIncludes: Boolean
domainIncludes: Place
comment: A flag to signal that the Place is open to public visitors. If this property is omitted there is no assumed default boolean value.

weightPercentage
type: Property
domainIncludes: ShippingRateSettings
isPartOf: pending.schema.org
source: https://github.com/schemaorg/schemaorg/issues/3617
rangeIncludes: Number
comment: Value in the range [0.0 ; 1.0] representing the fraction of the weight that is used to compute the shipping price.

workload
type: Property
isPartOf: health-lifesci.schema.org
domainIncludes: ExercisePlan
comment: Quantitative measure of the physiologic output of the exercise; also referred to as energy expenditure.
rangeIncludes: QuantitativeValue
rangeIncludes: Energy

School
type: Class
subclass of: EducationalOrganization
comment: A school.

WearableMeasurementSleeve
type: WearableMeasurementTypeEnumeration
source: https://github.com/schemaorg/schemaorg/issues/2811
isPartOf: pending.schema.org
comment: Measurement of the sleeve length, for example of a shirt.

LimitedByGuaranteeCharity
type: UKNonprofitType
isPartOf: pending.schema.org
source: https://github.com/schemaorg/schemaorg/issues/2543
comment: LimitedByGuaranteeCharity: Non-profit type referring to a charitable company that is limited by guarantee (UK).

isLiveBroadcast
type: Property
domainIncludes: BroadcastEvent
rangeIncludes: Boolean
comment: True if the broadcast is of a live event.

codeValue
type: Property
comment: A short textual code that uniquely identifies the value.
source: https://github.com/schemaorg/schemaorg/issues/894
domainIncludes: MedicalCode
domainIncludes: CategoryCode
sub property of: termCode
isPartOf: pending.schema.org
rangeIncludes: Text

termCode
type: Property
domainIncludes: DefinedTerm
source: https://github.com/schemaorg/schemaorg/issues/894
comment: A code that identifies this DefinedTerm within a DefinedTermSet.
rangeIncludes: Text
isPartOf: pending.schema.org

startDate
type: Property
domainIncludes: MerchantReturnPolicySeasonalOverride
domainIncludes: CreativeWorkSeason
domainIncludes: CreativeWorkSeries
domainIncludes: Role
domainIncludes: DatedMoneySpecification
domainIncludes: Schedule
domainIncludes: EducationalOccupationalProgram
domainIncludes: Event
source: https://github.com/schemaorg/schemaorg/issues/2486
rangeIncludes: DateTime
rangeIncludes: Date
equivalent property: hasStartDate
comment: The start date and time of the item (in [ISO 8601 date format](http://en.wikipedia.org/wiki/ISO_8601)).

Preschool
type: Class
comment: A preschool.
subclass of: EducationalOrganization

previousStartDate
type: Property
comment: Used in conjunction with eventStatus for rescheduled or cancelled events. This property contains the previously scheduled start date. For rescheduled events, the startDate property should be used for the newly scheduled start date. In the (rare) case of an event that has been postponed and rescheduled multiple times, this field may be repeated.
rangeIncludes: Date
domainIncludes: Event

prescriptionStatus
type: Property
isPartOf: health-lifesci.schema.org
comment: Indicates the status of drug prescription, e.g. local catalogs classifications or whether the drug is available by prescription or over-the-counter, etc.
rangeIncludes: DrugPrescriptionStatus
rangeIncludes: Text
domainIncludes: Drug

signDetected
type: Property
domainIncludes: MedicalTest
comment: A sign detected by the test.
rangeIncludes: MedicalSign
isPartOf: health-lifesci.schema.org

closes
type: Property
domainIncludes: OpeningHoursSpecification
comment: The closing hour of the place or service on the given day(s) of the week.
contributor: GoodRelationsTerms
rangeIncludes: Time

paymentDue
type: Property
rangeIncludes: DateTime
supersededBy: paymentDueDate
comment: The date that payment is due.
sub property of: hasPaymentDueDate
domainIncludes: Invoice
domainIncludes: Order
equivalent property: PaymentDueDate

paymentDueDate
type: Property
comment: The date that payment is due.
equivalent property: PaymentDueDate
domainIncludes: Invoice
domainIncludes: Order
rangeIncludes: DateTime
rangeIncludes: Date

Atlas
type: Class
source: Atlas
subclass of: CreativeWork
isPartOf: bib.schema.org
comment: A collection or bound volume of maps, charts, plates or tables, physical or in media form illustrating any subject.

TransitMap
type: MapCategoryType
comment: A transit map.

DietNutrition
type: MedicalSpecialty
comment: Dietetics and nutrition as a medical specialty.
subclass of: MedicalBusiness
isPartOf: health-lifesci.schema.org

fuelConsumption
type: Property
comment: The amount of fuel consumed for traveling a particular distance or temporal duration with the given vehicle (e.g. liters per 100 km).\n\n* Note 1: There are unfortunately no standard unit codes for liters per 100 km. Use unitText to indicate the unit of measurement, e.g. L/100 km.\n* Note 2: There are two ways of indicating the fuel consumption, fuelConsumption (e.g. 8 liters per 100 km) and fuelEfficiency (e.g. 30 miles per gallon). They are reciprocal.\n* Note 3: Often, the absolute value is useful only when related to driving speed ("at 80 km/h") or usage pattern ("city traffic"). You can use valueReference to link the value for the fuel consumption to another value.
rangeIncludes: QuantitativeValue
contributor: Automotive Ontology Working Group
domainIncludes: Vehicle

typeOfBed
type: Property
domainIncludes: BedDetails
rangeIncludes: Text
rangeIncludes: BedType
contributor: STI Accommodation Ontology
comment: The type of bed to which the BedDetail refers, i.e. the type of bed available in the quantity indicated by quantity.

scheduledTime
type: Property
rangeIncludes: Date
rangeIncludes: DateTime
domainIncludes: PlanAction
comment: The time the object is scheduled to.

Nonprofit501c20
type: USNonprofitType
source: https://github.com/schemaorg/schemaorg/issues/2543
isPartOf: pending.schema.org
comment: Nonprofit501c20: Non-profit type referring to Group Legal Services Plan Organizations.

customer
type: Property
domainIncludes: Invoice
domainIncludes: Order
comment: Party placing the order or paying the invoice.
rangeIncludes: Person
rangeIncludes: Organization

AutoWash
type: Class
subclass of: AutomotiveBusiness
comment: A car wash business.

itemDefectReturnLabelSource
type: Property
source: https://github.com/schemaorg/schemaorg/issues/2880
rangeIncludes: ReturnLabelSourceEnumeration
comment: The method (from an enumeration) by which the customer obtains a return shipping label for a defect product.
domainIncludes: MerchantReturnPolicy
isPartOf: pending.schema.org

lyrics
type: Property
domainIncludes: MusicComposition
contributor: MBZ
comment: The words in the song.
rangeIncludes: CreativeWork

percentile25
type: Property
source: https://github.com/schemaorg/schemaorg/issues/1698
rangeIncludes: Number
comment: The 25th percentile value.
domainIncludes: QuantitativeValueDistribution

EUEnergyEfficiencyCategoryF
type: EUEnergyEfficiencyEnumeration
comment: Represents EU Energy Efficiency Class F as defined in EU energy labeling regulations.
isPartOf: pending.schema.org
source: https://github.com/schemaorg/schemaorg/issues/2670

legislationType
type: Property
source: https://github.com/schemaorg/schemaorg/issues/1156
source: eli
sub property of: genre
domainIncludes: Legislation
rangeIncludes: Text
rangeIncludes: CategoryCode
contributor: ELI
isPartOf: pending.schema.org
equivalent property: type document
comment: The type of the legislation. Examples of values are "law", "act", "directive", "decree", "regulation", "statutory instrument", "loi organique", "règlement grand-ducal", etc., depending on the country.

genre
type: Property
domainIncludes: BroadcastChannel
domainIncludes: CreativeWork
domainIncludes: MusicGroup
comment: Genre of the creative work, broadcast channel or group.
rangeIncludes: URL
rangeIncludes: Text
rangeIncludes: DefinedTerm

sportsActivityLocation
type: Property
rangeIncludes: SportsActivityLocation
comment: A sub property of location. The sports activity location where this action occurred.
sub property of: location
domainIncludes: ExerciseAction

PodcastSeason
type: Class
isPartOf: pending.schema.org
comment: A single season of a podcast. Many podcasts do not break down into separate seasons. In that case, PodcastSeries should be used.
subclass of: CreativeWorkSeason
source: https://github.com/schemaorg/schemaorg/issues/373

supersededBy
type: Property
domainIncludes: Property
domainIncludes: Enumeration
domainIncludes: Class
rangeIncludes: Property
rangeIncludes: Class
rangeIncludes: Enumeration
isPartOf: meta.schema.org
comment: Relates a term (i.e. a property, class or enumeration) to one that supersedes it.

TaxiStand
type: Class
subclass of: CivicStructure
comment: A taxi stand.

blogPosts
type: Property
rangeIncludes: BlogPosting
supersededBy: blogPost
comment: Indicates a post that is part of a Blog. Note that historically, what we term a "Blog" was once known as a "weblog", and that what we term a "BlogPosting" is now often colloquially referred to as a "blog".
domainIncludes: Blog

blogPost
type: Property
domainIncludes: Blog
comment: A posting that is part of this blog.
rangeIncludes: BlogPosting

announcementLocation
type: Property
isPartOf: pending.schema.org
sub property of: spatialCoverage
domainIncludes: SpecialAnnouncement
comment: Indicates a specific CivicStructure or LocalBusiness associated with the SpecialAnnouncement. For example, a specific testing facility or business with special opening hours. For a larger geographic region like a quarantine of an entire region, use spatialCoverage.
source: https://github.com/schemaorg/schemaorg/issues/2514
rangeIncludes: CivicStructure
rangeIncludes: LocalBusiness

spatialCoverage
type: Property
comment: The spatialCoverage of a CreativeWork indicates the place(s) which are the focus of the content. It is a subproperty of contentLocation intended primarily for more technical and detailed materials. For example with a Dataset, it indicates areas that the dataset describes: a dataset of New York weather would have spatialCoverage which was the place: the state of New York.
equivalent property: spatial
rangeIncludes: Place
sub property of: contentLocation
domainIncludes: CreativeWork

departureTime
type: Property
rangeIncludes: Time
rangeIncludes: DateTime
comment: The expected departure time.
domainIncludes: Trip

tocEntry
type: Property
domainIncludes: HyperToc
comment: Indicates a HyperTocEntry in a HyperToc.
sub property of: hasPart
source: https://github.com/schemaorg/schemaorg/issues/2766
isPartOf: pending.schema.org
rangeIncludes: HyperTocEntry

hasPart
type: Property
inverseOf: isPartOf
comment: Indicates an item or CreativeWork that is part of this item, or CreativeWork (in some sense).
rangeIncludes: CreativeWork
domainIncludes: CreativeWork
contributor: bibex

acquiredFrom
type: Property
domainIncludes: OwnershipInfo
rangeIncludes: Person
rangeIncludes: Organization
comment: The organization or person from which the product was acquired.
contributor: GoodRelationsTerms

partOfSeason
type: Property
rangeIncludes: CreativeWorkSeason
domainIncludes: Clip
domainIncludes: Episode
sub property of: isPartOf
comment: The season to which this episode belongs.

isPartOf
type: Property
rangeIncludes: URL
rangeIncludes: CreativeWork
comment: Indicates an item or CreativeWork that this item, or CreativeWork (in some sense), is part of.
inverseOf: hasPart
domainIncludes: CreativeWork

nutrition
type: Property
domainIncludes: Recipe
domainIncludes: MenuItem
rangeIncludes: NutritionInformation
comment: Nutrition information about the recipe or menu item.

Cooperative
type: Class
comment: An organization that is a joint project of multiple organizations or persons.
subclass of: Organization
equivalent class: CooperativeSociety

modelDate
type: Property
rangeIncludes: Date
isPartOf: auto.schema.org
comment: The release date of a vehicle model (often used to differentiate versions of the same make and model).
contributor: Automotive Ontology Working Group
domainIncludes: Vehicle

eventSchedule
type: Property
isPartOf: pending.schema.org
source: https://github.com/schemaorg/schemaorg/issues/1457
domainIncludes: Event
comment: Associates an Event with a Schedule. There are circumstances where it is preferable to share a schedule for a series of repeating events rather than data on the individual events themselves. For example, a website or application might prefer to publish a schedule for a weekly gym class rather than provide data on every event. A schedule could be processed by applications to add forthcoming events to a calendar. An Event that is associated with a Schedule using this property should not have startDate or endDate properties. These are instead defined within the associated Schedule, this avoids any ambiguity for clients using the data. The property might have repeated values to specify different schedules, e.g. for different months or seasons.
rangeIncludes: Schedule

valueRequired
type: Property
domainIncludes: PropertyValueSpecification
rangeIncludes: Boolean
comment: Whether the property must be filled in to complete the action. Default is false.

deliveryTime
type: Property
domainIncludes: DeliveryTimeSettings
domainIncludes: OfferShippingDetails
comment: The total delay between the receipt of the order and the goods reaching the final customer.
source: https://github.com/schemaorg/schemaorg/issues/2506
rangeIncludes: ShippingDeliveryTime

embedUrl
type: Property
rangeIncludes: URL
domainIncludes: MediaObject
comment: A URL pointing to a player for a specific video. In general, this is the information in the ```src``` element of an ```embed``` tag and should not be the same as the content of the ```loc``` tag.

ScreenCaptureDigitalSource
type: IPTCDigitalSourceEnumeration
isPartOf: pending.schema.org
source: https://github.com/schemaorg/schemaorg/issues/3392
comment: Content coded as 'algorithmic media' using the IPTC digital source type vocabulary.

vehicleTransmission
type: Property
domainIncludes: Vehicle
rangeIncludes: Text
rangeIncludes: QualitativeValue
rangeIncludes: URL
comment: The type of component used for transmitting the power from a rotating power source to the wheels or other relevant component(s) ("gearbox" for cars).
contributor: Automotive Ontology Working Group

programmingLanguage
type: Property
rangeIncludes: ComputerLanguage
rangeIncludes: Text
domainIncludes: SoftwareSourceCode
comment: The computer programming language.

targetDescription
type: Property
rangeIncludes: Text
comment: The description of a node in an established educational framework.
domainIncludes: AlignmentObject

orderDate
type: Property
equivalent property: OrderDate
domainIncludes: Order
rangeIncludes: DateTime
rangeIncludes: Date
sub property of: hasDate
comment: Date order was placed.

quest
type: Property
domainIncludes: Game
domainIncludes: VideoGameSeries
comment: The task that a player-controlled character, or group of characters may complete in order to gain a reward.
rangeIncludes: Thing

DistanceFee
type: PriceComponentTypeEnumeration
comment: Represents the distance fee (e.g., price per km or mile) part of the total price for an offered product, for example a car rental.
isPartOf: pending.schema.org
source: https://github.com/schemaorg/schemaorg/issues/2689

memoryRequirements
type: Property
comment: Minimum memory requirements.
domainIncludes: SoftwareApplication
rangeIncludes: URL
rangeIncludes: Text

titleEIDR
type: Property
comment: An [EIDR](https://eidr.org/) (Entertainment Identifier Registry) identifier representing at the most general/abstract level, a work of film or television. For example, the motion picture known as "Ghostbusters" has a titleEIDR of "10.5240/7EC7-228A-510A-053E-CBB8-J". This title (or work) may have several variants, which EIDR calls "edits". See editEIDR. Since schema.org types like Movie, TVEpisode, TVSeason, and TVSeries can be used for both works and their multiple expressions, it is possible to use titleEIDR alone (for a general description), or alongside editEIDR for a more edit-specific description.
rangeIncludes: URL
rangeIncludes: Text
domainIncludes: TVSeries
domainIncludes: TVSeason
domainIncludes: Movie
domainIncludes: TVEpisode
isPartOf: pending.schema.org
sub property of: identifier
source: https://github.com/schemaorg/schemaorg/issues/2469

teaches
type: Property
rangeIncludes: DefinedTerm
rangeIncludes: Text
domainIncludes: LearningResource
domainIncludes: EducationEvent
domainIncludes: CreativeWork
source: https://github.com/schemaorg/schemaorg/issues/2427
isPartOf: pending.schema.org
comment: The item being described is intended to help a person learn the competency or learning outcome defined by the referenced term.

bestRating
type: Property
rangeIncludes: Text
rangeIncludes: Number
domainIncludes: Rating
comment: The highest value allowed in this rating system.

relatedCondition
type: Property
domainIncludes: AnatomicalStructure
domainIncludes: AnatomicalSystem
domainIncludes: SuperficialAnatomy
comment: A medical condition associated with this anatomy.
rangeIncludes: MedicalCondition
isPartOf: health-lifesci.schema.org

gettingTestedInfo
type: Property
comment: Information about getting tested (for a MedicalCondition), e.g. in the context of a pandemic.
isPartOf: pending.schema.org
source: https://github.com/schemaorg/schemaorg/issues/2490
rangeIncludes: URL
rangeIncludes: WebContent
domainIncludes: SpecialAnnouncement

InStorePrepay
type: PaymentMethodType
comment: Payment in advance in some form of shop or kiosk for goods purchased online.

PerformingArtsTheater
type: Class
comment: A theater or other performing art center.
subclass of: CivicStructure

jobStartDate
type: Property
source: https://github.com/schemaorg/schemaorg/issues/2244
rangeIncludes: Date
rangeIncludes: Text
comment: The date on which a successful applicant for this job would be expected to start work. Choose a specific date in the future or use the jobImmediateStart property to indicate the position is to be filled as soon as possible.
domainIncludes: JobPosting
isPartOf: pending.schema.org

NegativeFilmDigitalSource
type: IPTCDigitalSourceEnumeration
comment: Content coded as 'negative film' using the IPTC digital source type vocabulary.
isPartOf: pending.schema.org
source: https://github.com/schemaorg/schemaorg/issues/3392

Taxi
type: Class
supersededBy: TaxiService
comment: A taxi.
subclass of: Service

floorLevel
type: Property
source: https://github.com/schemaorg/schemaorg/issues/2373
rangeIncludes: Text
isPartOf: pending.schema.org
comment: The floor level for an Accommodation in a multi-storey building. Since counting systems [vary internationally](https://en.wikipedia.org/wiki/Storey#Consecutive_number_floor_designations), the local system should be used where possible.
domainIncludes: Accommodation

timeToComplete
type: Property
isPartOf: pending.schema.org
rangeIncludes: Duration
source: https://github.com/schemaorg/schemaorg/issues/2289
comment: The expected length of time to complete the program if attending full-time.
domainIncludes: EducationalOccupationalProgram

maxValue
type: Property
domainIncludes: QuantitativeValue
domainIncludes: PropertyValueSpecification
domainIncludes: MonetaryAmount
domainIncludes: PropertyValue
rangeIncludes: Number
comment: The upper value of some characteristic or property.
sub property of: hasUpperBound
contributor: GoodRelationsTerms

AnalysisNewsArticle
type: Class
source: https://github.com/schemaorg/schemaorg/issues/1525
contributor: TP
comment: An AnalysisNewsArticle is a NewsArticle that, while based on factual reporting, incorporates the expertise of the author/producer, offering interpretations and conclusions.
isPartOf: pending.schema.org
subclass of: NewsArticle

commentTime
type: Property
rangeIncludes: Date
rangeIncludes: DateTime
domainIncludes: UserComments
comment: The time at which the UserComment was made.

legislationResponsible
type: Property
source: https://github.com/schemaorg/schemaorg/issues/1156
source: eli
rangeIncludes: Person
rangeIncludes: Organization
domainIncludes: Legislation
contributor: ELI
comment: An individual or organization that has some kind of responsibility for the legislation. Typically the ministry who is/was in charge of elaborating the legislation, or the adressee for potential questions about the legislation once it is published.
isPartOf: pending.schema.org
equivalent property: responsibility of

overdosage
type: Property
rangeIncludes: Text
domainIncludes: Drug
comment: Any information related to overdose on a drug, including signs or symptoms, treatments, contact information for emergency response.
isPartOf: health-lifesci.schema.org

inProductGroupWithID
type: Property
isPartOf: pending.schema.org
source: https://github.com/schemaorg/schemaorg/issues/1797
comment: Indicates the productGroupID for a ProductGroup that this product isVariantOf.
equivalent property: variantId
rangeIncludes: Text
domainIncludes: Product

drug
type: Property
rangeIncludes: Drug
domainIncludes: TherapeuticProcedure
domainIncludes: MedicalCondition
domainIncludes: DrugClass
domainIncludes: Patient
isPartOf: health-lifesci.schema.org
comment: Specifying a drug or medicine used in a medication procedure.

COD
type: PaymentMethodType
comment: Cash on Delivery (COD) payment, equivalent to http://purl.org/goodrelations/v1#COD.

certificationRating
type: Property
domainIncludes: Certification
rangeIncludes: Rating
comment: Rating of a certification instance (as defined by an independent certification body). Typically this rating can be used to rate the level to which the requirements of the certification instance are fulfilled. See also [gs1:certificationValue](https://www.gs1.org/voc/certificationValue).
source: https://github.com/schemaorg/schemaorg/issues/3230
isPartOf: pending.schema.org

fileFormat
type: Property
domainIncludes: CreativeWork
supersededBy: encodingFormat
rangeIncludes: URL
rangeIncludes: Text
comment: Media type, typically MIME format (see [IANA site](http://www.iana.org/assignments/media-types/media-types.xhtml)) of the content, e.g. application/zip of a SoftwareApplication binary. In cases where a CreativeWork has several media type representations, 'encoding' can be used to indicate each MediaObject alongside particular fileFormat information. Unregistered or niche file formats can be indicated instead via the most appropriate URL, e.g. defining Web page or a Wikipedia entry.

encodingFormat
type: Property
rangeIncludes: URL
rangeIncludes: Text
domainIncludes: CreativeWork
domainIncludes: MediaObject
comment: Media type typically expressed using a MIME format (see [IANA site](http://www.iana.org/assignments/media-types/media-types.xhtml) and [MDN reference](https://developer.mozilla.org/en-US/docs/Web/HTTP/Basics_of_HTTP/MIME_types)), e.g. application/zip for a SoftwareApplication binary, audio/mpeg for .mp3 etc. In cases where a CreativeWork has several media type representations, encoding can be used to indicate each MediaObject alongside particular encodingFormat information. Unregistered or niche encoding and file formats can be indicated instead via the most appropriate URL, e.g. defining Web page or a Wikipedia/Wikidata entry.

priceRange
type: Property
domainIncludes: LocalBusiness
rangeIncludes: Text
comment: The price range of the business, for example ```$$$```.

travelBans
type: Property
domainIncludes: SpecialAnnouncement
rangeIncludes: URL
rangeIncludes: WebContent
isPartOf: pending.schema.org
comment: Information about travel bans, e.g. in the context of a pandemic.
source: https://github.com/schemaorg/schemaorg/issues/2490

CaseSeries
type: MedicalObservationalStudyDesign
comment: A case series (also known as a clinical series) is a medical research study that tracks patients with a known exposure given similar treatment or examines their medical records for exposure and outcome. A case series can be retrospective or prospective and usually involves a smaller number of patients than the more powerful case-control studies or randomized controlled trials. Case series may be consecutive or non-consecutive, depending on whether all cases presenting to the reporting authors over a period of time were included, or only a selection.
isPartOf: health-lifesci.schema.org

cvdNumC19Died
type: Property
comment: numc19died - DEATHS: Patients with suspected or confirmed COVID-19 who died in the hospital, ED, or any overflow location.
domainIncludes: CDCPMDRecord
isPartOf: pending.schema.org
source: https://github.com/schemaorg/schemaorg/issues/2521
rangeIncludes: Number

SurgicalProcedure
type: Class
comment: A medical procedure involving an incision with instruments; performed for diagnose, or therapeutic purposes.
isPartOf: health-lifesci.schema.org
subclass of: MedicalProcedure
equivalent class: http://purl.bioontology.org/ontology/SNOMEDCT/387713003

recognizingAuthority
type: Property
comment: If applicable, the organization that officially recognizes this entity as part of its endorsed system of medicine.
isPartOf: health-lifesci.schema.org
rangeIncludes: Organization
domainIncludes: MedicalEntity

NarcoticConsideration
type: AdultOrientedEnumeration
source: https://github.com/schemaorg/schemaorg/issues/2989
comment: Item is a narcotic as defined by the [1961 UN convention](https://www.incb.org/incb/en/narcotic-drugs/Yellowlist/yellow-list.html), for example marijuana or heroin.
isPartOf: pending.schema.org

UserPageVisits
type: Class
comment: UserInteraction and its subtypes is an old way of talking about users interacting with pages. It is generally better to use Action-based vocabulary, alongside types such as Comment.
supersededBy: InteractionCounter
subclass of: UserInteraction

legislationJurisdiction
type: Property
rangeIncludes: Text
rangeIncludes: AdministrativeArea
contributor: ELI
equivalent property: jurisdiction
source: eli
source: https://github.com/schemaorg/schemaorg/issues/1156
sub property of: jurisdiction
sub property of: spatialCoverage
isPartOf: pending.schema.org
comment: The jurisdiction from which the legislation originates.
domainIncludes: Legislation

jurisdiction
type: Property
rangeIncludes: AdministrativeArea
rangeIncludes: Text
domainIncludes: Legislation
domainIncludes: GovernmentService
isPartOf: pending.schema.org
comment: Indicates a legal jurisdiction, e.g. of some legislation, or where some government service is based.
source: https://github.com/schemaorg/schemaorg/issues/2534

EUEnergyEfficiencyCategoryA3Plus
type: EUEnergyEfficiencyEnumeration
source: https://github.com/schemaorg/schemaorg/issues/2670
comment: Represents EU Energy Efficiency Class A+++ as defined in EU energy labeling regulations.
isPartOf: pending.schema.org

numConstraints
type: Property
rangeIncludes: Integer
isPartOf: pending.schema.org
domainIncludes: ConstraintNode
source: https://github.com/schemaorg/schemaorg/issues/2291
comment: Indicates the number of constraints property values defined for a particular ConstraintNode such as StatisticalVariable. This helps applications understand if they have access to a sufficiently complete description of a StatisticalVariable or other construct that is defined using properties on template-style nodes.

Genitourinary
type: PhysicalExam
isPartOf: health-lifesci.schema.org
comment: Genitourinary system function assessment with clinical examination.

AutoBodyShop
type: Class
subclass of: AutomotiveBusiness
comment: Auto body shop.

OceanBodyOfWater
type: Class
comment: An ocean (for example, the Pacific).
subclass of: BodyOfWater

Nursing
type: MedicalSpecialty
subclass of: MedicalBusiness
comment: A health profession of a person formally educated and trained in the care of the sick or infirm person.
isPartOf: health-lifesci.schema.org

productSupported
type: Property
comment: The product or service this support contact point is related to (such as product support for a particular product line). This can be a specific product or product line (e.g. "iPhone") or a general category of products or services (e.g. "smartphones").
domainIncludes: ContactPoint
rangeIncludes: Text
rangeIncludes: Product

item
type: Property
rangeIncludes: Thing
domainIncludes: ListItem
domainIncludes: DataFeedItem
comment: An entity represented by an entry in a list or data feed (e.g. an 'artist' in a list of 'artists').

assemblyVersion
type: Property
rangeIncludes: Text
domainIncludes: APIReference
comment: Associated product/technology version. E.g., .NET Framework 4.5.

molecularFormula
type: Property
rangeIncludes: Text
isPartOf: pending.schema.org
source: MolecularEntity
comment: The empirical formula is the simplest whole number ratio of all the atoms in a molecule.
domainIncludes: MolecularEntity

TakeAction
type: Class
comment: The act of gaining ownership of an object from an origin. Reciprocal of GiveAction.\n\nRelated actions:\n\n* GiveAction: The reciprocal of TakeAction.\n* ReceiveAction: Unlike ReceiveAction, TakeAction implies that ownership has been transferred.
subclass of: TransferAction

relatedDrug
type: Property
isPartOf: health-lifesci.schema.org
domainIncludes: Drug
comment: Any other drug related to this one, for example commonly-prescribed alternatives.
rangeIncludes: Drug

taxID
type: Property
comment: The Tax / Fiscal ID of the organization or person, e.g. the TIN in the US or the CIF/NIF in Spain.
contributor: GoodRelationsTerms
equivalent property: hasTaxIdentifier
domainIncludes: Person
domainIncludes: Organization
rangeIncludes: Text
sub property of: identifier

healthPlanPharmacyCategory
type: Property
comment: The category or type of pharmacy associated with this cost sharing.
source: https://github.com/schemaorg/schemaorg/issues/1062
domainIncludes: HealthPlanCostSharingSpecification
rangeIncludes: Text
isPartOf: pending.schema.org

returnShippingFeesAmount
type: Property
comment: Amount of shipping costs for product returns (for any reason). Applicable when property returnFees equals ReturnShippingFees.
rangeIncludes: MonetaryAmount
isPartOf: pending.schema.org
domainIncludes: MerchantReturnPolicySeasonalOverride
domainIncludes: MerchantReturnPolicy
source: https://github.com/schemaorg/schemaorg/issues/2880

FurnitureStore
type: Class
subclass of: Store
comment: A furniture store.

OutletStore
type: Class
comment: An outlet store.
subclass of: Store

educationalCredentialAwarded
type: Property
rangeIncludes: Text
rangeIncludes: EducationalOccupationalCredential
rangeIncludes: URL
domainIncludes: EducationalOccupationalProgram
domainIncludes: Course
comment: A description of the qualification, award, certificate, diploma or other educational credential awarded as a consequence of successful completion of this course or program.
source: https://github.com/schemaorg/schemaorg/issues/2289

Radiography
type: MedicalSpecialty
type: MedicalImagingTechnique
comment: Radiography is an imaging technique that uses electromagnetic radiation other than visible light, especially X-rays, to view the internal structure of a non-uniformly composed and opaque object such as the human body.
isPartOf: health-lifesci.schema.org

healthPlanDrugTier
type: Property
comment: The tier(s) of drugs offered by this formulary or insurance plan.
isPartOf: pending.schema.org
source: https://github.com/schemaorg/schemaorg/issues/1062
domainIncludes: HealthPlanFormulary
domainIncludes: HealthInsurancePlan
rangeIncludes: Text

seatNumber
type: Property
comment: The location of the reserved seat (e.g., 27).
domainIncludes: Seat
rangeIncludes: Text

shippingDestination
type: Property
domainIncludes: OfferShippingDetails
domainIncludes: ShippingConditions
domainIncludes: ShippingRateSettings
domainIncludes: DeliveryTimeSettings
rangeIncludes: DefinedRegion
source: https://github.com/schemaorg/schemaorg/issues/2506
source: https://github.com/schemaorg/schemaorg/issues/3617
comment: indicates (possibly multiple) shipping destinations. These can be defined in several ways, e.g. postalCode ranges.

totalPrice
type: Property
rangeIncludes: Number
rangeIncludes: Text
rangeIncludes: PriceSpecification
comment: The total price for the reservation or ticket, including applicable taxes, shipping, etc.\n\nUsage guidelines:\n\n* Use values from 0123456789 (Unicode 'DIGIT ZERO' (U+0030) to 'DIGIT NINE' (U+0039)) rather than superficially similar Unicode symbols.\n* Use '.' (Unicode 'FULL STOP' (U+002E)) rather than ',' to indicate a decimal point. Avoid using these symbols as a readability separator.
domainIncludes: Reservation
domainIncludes: Ticket

Midwifery
type: MedicalSpecialty
comment: A nurse-like health profession that deals with pregnancy, childbirth, and the postpartum period (including care of the newborn), besides sexual and reproductive health of women throughout their lives.
subclass of: MedicalBusiness
isPartOf: health-lifesci.schema.org

legislationConsolidates
type: Property
comment: Indicates another legislation taken into account in this consolidated legislation (which is usually the product of an editorial process that revises the legislation). This property should be used multiple times to refer to both the original version or the previous consolidated version, and to the legislations making the change.
source: https://github.com/schemaorg/schemaorg/issues/1156
source: eli
equivalent property: consolidates
domainIncludes: Legislation
contributor: ELI
rangeIncludes: Legislation
isPartOf: pending.schema.org

ParkingFacility
type: Class
comment: A parking lot or other parking facility.
subclass of: CivicStructure

cvdNumBedsOcc
type: Property
isPartOf: pending.schema.org
domainIncludes: CDCPMDRecord
comment: numbedsocc - HOSPITAL INPATIENT BED OCCUPANCY: Total number of staffed inpatient beds that are occupied.
source: https://github.com/schemaorg/schemaorg/issues/2521
rangeIncludes: Number

marginOfError
type: Property
comment: A marginOfError for an Observation.
rangeIncludes: QuantitativeValue
domainIncludes: Observation
isPartOf: pending.schema.org
source: https://github.com/schemaorg/schemaorg/issues/2291

legalStatus
type: Property
rangeIncludes: Text
rangeIncludes: DrugLegalStatus
rangeIncludes: MedicalEnumeration
domainIncludes: MedicalEntity
domainIncludes: Drug
domainIncludes: DietarySupplement
isPartOf: health-lifesci.schema.org
comment: The drug or supplement's legal status, including any controlled substance schedules that apply.

fromLocation
type: Property
rangeIncludes: Place
sub property of: location
domainIncludes: MoveAction
domainIncludes: TransferAction
domainIncludes: ExerciseAction
comment: A sub property of location. The original location of the object or the agent before the action.

healthcareReportingData
type: Property
source: https://github.com/schemaorg/schemaorg/issues/2521
domainIncludes: Hospital
isPartOf: pending.schema.org
rangeIncludes: Dataset
rangeIncludes: CDCPMDRecord
comment: Indicates data describing a hospital, e.g. a CDC CDCPMDRecord or as some kind of Dataset.

pagination
type: Property
rangeIncludes: Text
domainIncludes: PublicationVolume
domainIncludes: Chapter
domainIncludes: PublicationIssue
domainIncludes: Article
contributor: bibex
equivalent property: pages
comment: Any description of pages that is not separated into pageStart and pageEnd; for example, "1-6, 9, 55" or "10-12, 46-49".

UnincorporatedAssociationCharity
type: UKNonprofitType
source: https://github.com/schemaorg/schemaorg/issues/2543
comment: UnincorporatedAssociationCharity: Non-profit type referring to a charitable company that is not incorporated (UK).
isPartOf: pending.schema.org

query
type: Property
comment: A sub property of instrument. The query used on this action.
rangeIncludes: Text
sub property of: instrument
domainIncludes: SearchAction

DemoGameAvailability
type: GameAvailabilityEnumeration
isPartOf: pending.schema.org
source: https://github.com/schemaorg/schemaorg/issues/3058
comment: Indicates demo game availability, i.e. a somehow limited demonstration of the full game.

VitalSign
type: Class
comment: Vital signs are measures of various physiological functions in order to assess the most basic body functions.
isPartOf: health-lifesci.schema.org
subclass of: MedicalSign

industry
type: Property
comment: The industry associated with the job position.
rangeIncludes: DefinedTerm
rangeIncludes: Text
domainIncludes: JobPosting

repeatFrequency
type: Property
domainIncludes: Schedule
rangeIncludes: Text
rangeIncludes: Duration
source: https://github.com/schemaorg/schemaorg/issues/1457
isPartOf: pending.schema.org
sub property of: frequency
comment: Defines the frequency at which Events will occur according to a schedule Schedule. The intervals between events should be defined as a Duration of time.

frequency
type: Property
comment: How often the dose is taken, e.g. 'daily'.
rangeIncludes: Text
isPartOf: health-lifesci.schema.org
domainIncludes: DoseSchedule

geoRadius
type: Property
rangeIncludes: Number
rangeIncludes: Distance
rangeIncludes: Text
comment: Indicates the approximate radius of a GeoCircle (metres unless indicated otherwise via Distance notation).
domainIncludes: GeoCircle

infectiousAgentClass
type: Property
isPartOf: health-lifesci.schema.org
rangeIncludes: InfectiousAgentClass
comment: The class of infectious agent (bacteria, prion, etc.) that causes the disease.
domainIncludes: InfectiousDisease

associatedDisease
type: Property
source: BioChemEntity
domainIncludes: BioChemEntity
isPartOf: pending.schema.org
comment: Disease associated to this BioChemEntity. Such disease can be a MedicalCondition or a URL. If you want to add an evidence supporting the association, please use PropertyValue.
rangeIncludes: MedicalCondition
rangeIncludes: URL
rangeIncludes: PropertyValue

infectiousAgent
type: Property
isPartOf: health-lifesci.schema.org
rangeIncludes: Text
comment: The actual infectious agent, such as a specific bacterium.
domainIncludes: InfectiousDisease

returnPolicyCountry
type: Property
rangeIncludes: Country
rangeIncludes: Text
comment: The country where the product has to be sent to for returns, for example "Ireland" using the name property of Country. You can also provide the two-letter [ISO 3166-1 alpha-2 country code](http://en.wikipedia.org/wiki/ISO_3166-1). Note that this can be different from the country where the product was originally shipped from or sent to.
isPartOf: pending.schema.org
domainIncludes: MerchantReturnPolicy
source: https://github.com/schemaorg/schemaorg/issues/2880

applicantLocationRequirements
type: Property
rangeIncludes: AdministrativeArea
comment: The location(s) applicants can apply from. This is usually used for telecommuting jobs where the applicant does not need to be in a physical office. Note: This should not be used for citizenship or work visa requirements.
domainIncludes: JobPosting
source: https://github.com/schemaorg/schemaorg/issues/2083
isPartOf: pending.schema.org

digitalSourceType
type: Property
rangeIncludes: IPTCDigitalSourceEnumeration
domainIncludes: CreativeWork
isPartOf: pending.schema.org
comment: Indicates an IPTCDigitalSourceEnumeration code indicating the nature of the digital source(s) for some CreativeWork.
source: https://github.com/schemaorg/schemaorg/issues/3392

box
type: Property
comment: A box is the area enclosed by the rectangle formed by two points. The first point is the lower corner, the second point is the upper corner. A box is expressed as two points separated by a space character.
rangeIncludes: Text
domainIncludes: GeoShape

BefriendAction
type: Class
subclass of: InteractAction
comment: The act of forming a personal connection with someone (object) mutually/bidirectionally/symmetrically.\n\nRelated actions:\n\n* FollowAction: Unlike FollowAction, BefriendAction implies that the connection is reciprocal.

ArtGallery
type: Class
comment: An art gallery.
subclass of: EntertainmentBusiness

expectsAcceptanceOf
type: Property
domainIncludes: ConsumeAction
domainIncludes: ActionAccessSpecification
domainIncludes: MediaSubscription
rangeIncludes: Offer
source: https://github.com/schemaorg/schemaorg/issues/1741
comment: An Offer which must be accepted before the user can perform the Action. For example, the user may need to buy a movie before being able to watch it.

PhoneCarrierPayment
type: PaymentMethodType
comment: Payment by billing via the phone carrier.

orderQuantity
type: Property
equivalent property: orderQuantity
rangeIncludes: QuantitativeValue
rangeIncludes: Number
comment: The number of the item ordered. If the property is not set, assume the quantity is one.
domainIncludes: OrderItem
sub property of: hasQuantity

value
type: Property
domainIncludes: PropertyValue
domainIncludes: QuantitativeValue
domainIncludes: MonetaryAmount
comment: The value of a QuantitativeValue (including Observation) or property value node.\n\n* For QuantitativeValue and MonetaryAmount, the recommended type for values is 'Number'.\n* For PropertyValue, it can be 'Text', 'Number', 'Boolean', or 'StructuredValue'.\n* Use values from 0123456789 (Unicode 'DIGIT ZERO' (U+0030) to 'DIGIT NINE' (U+0039)) rather than superficially similar Unicode symbols.\n* Use '.' (Unicode 'FULL STOP' (U+002E)) rather than ',' to indicate a decimal point. Avoid using these symbols as a readability separator.
rangeIncludes: Boolean
rangeIncludes: Number
rangeIncludes: Text
rangeIncludes: StructuredValue
contributor: GoodRelationsTerms

legislationRepeals
type: Property
sub property of: legislationChanges
domainIncludes: Legislation
contributor: ELI
source: eli
source: https://github.com/schemaorg/schemaorg/issues/2698
rangeIncludes: Legislation
isPartOf: pending.schema.org
equivalent property: repeals
comment: Another legislation that this legislation repeals (cancels, abrogates).

fuelCapacity
type: Property
isPartOf: auto.schema.org
comment: The capacity of the fuel tank or in the case of electric cars, the battery. If there are multiple components for storage, this should indicate the total of all storage of the same type.\n\nTypical unit code(s): LTR for liters, GLL of US gallons, GLI for UK / imperial gallons, AMH for ampere-hours (for electrical vehicles).
contributor: Automotive Ontology Working Group
rangeIncludes: QuantitativeValue
domainIncludes: Vehicle

HomeGoodsStore
type: Class
subclass of: Store
comment: A home goods store.

broadcaster
type: Property
comment: The organization owning or operating the broadcast service.
rangeIncludes: Organization
domainIncludes: BroadcastService

targetName
type: Property
comment: The name of a node in an established educational framework.
rangeIncludes: Text
domainIncludes: AlignmentObject

valueAddedTaxIncluded
type: Property
rangeIncludes: Boolean
contributor: GoodRelationsTerms
comment: Specifies whether the applicable value-added tax (VAT) is included in the price specification or not.
domainIncludes: PriceSpecification

validFrom
type: Property
domainIncludes: FinancialIncentive
domainIncludes: PriceSpecification
domainIncludes: Demand
domainIncludes: LocationFeatureSpecification
domainIncludes: Permit
domainIncludes: Offer
domainIncludes: OpeningHoursSpecification
domainIncludes: MonetaryAmount
domainIncludes: Certification
rangeIncludes: DateTime
rangeIncludes: Date
equivalent property: hasStartDate
contributor: GoodRelationsTerms
comment: The date when the item becomes valid.

WearableSizeSystemJP
type: WearableSizeSystemEnumeration
source: https://github.com/schemaorg/schemaorg/issues/2811
isPartOf: pending.schema.org
comment: Japanese size system for wearables.

Nonprofit501c8
type: USNonprofitType
isPartOf: pending.schema.org
source: https://github.com/schemaorg/schemaorg/issues/2543
comment: Nonprofit501c8: Non-profit type referring to Fraternal Beneficiary Societies and Associations.

chemicalComposition
type: Property
source: ChemicalSubstance
rangeIncludes: Text
comment: The chemical composition describes the identity and relative ratio of the chemical elements that make up the substance.
isPartOf: pending.schema.org
domainIncludes: ChemicalSubstance

inverseOf
type: Property
rangeIncludes: Property
isPartOf: meta.schema.org
comment: Relates a property to a property that is its inverse. Inverse properties relate the same pairs of items to each other, but in reversed direction. For example, the 'alumni' and 'alumniOf' properties are inverseOf each other. Some properties don't have explicit inverses; in these situations RDFa and JSON-LD syntax for reverse properties can be used.
domainIncludes: Property

Crematorium
type: Class
subclass of: CivicStructure
comment: A crematorium.

hasSponsorshipOffer
type: Property
source: https://github.com/schemaorg/schemaorg/issues/4495
comment: An offer to sponsor the event, for example, Sponsorship Prospectus, Sponsorship Opportunities, or Sponsor Packages.
isPartOf: pending.schema.org
rangeIncludes: Offer
domainIncludes: Event

cvdNumICUBedsOcc
type: Property
domainIncludes: CDCPMDRecord
isPartOf: pending.schema.org
rangeIncludes: Number
source: https://github.com/schemaorg/schemaorg/issues/2521
comment: numicubedsocc - ICU BED OCCUPANCY: Total number of staffed inpatient ICU beds that are occupied.

PawnShop
type: Class
subclass of: Store
comment: A shop that will buy, or lend money against the security of, personal possessions.

map
type: Property
comment: A URL to a map of the place.
rangeIncludes: URL
domainIncludes: Place
supersededBy: hasMap

hasMap
type: Property
rangeIncludes: URL
rangeIncludes: Map
domainIncludes: Place
comment: A URL to a map of the place.

dependencies
type: Property
comment: Prerequisites needed to fulfill steps in article.
rangeIncludes: Text
domainIncludes: TechArticle

repeatCount
type: Property
comment: Defines the number of times a recurring Event will take place.
isPartOf: pending.schema.org
domainIncludes: Schedule
rangeIncludes: Integer
source: https://github.com/schemaorg/schemaorg/issues/1457

broadcastSignalModulation
type: Property
source: https://github.com/schemaorg/schemaorg/issues/2111
domainIncludes: BroadcastFrequencySpecification
rangeIncludes: QualitativeValue
rangeIncludes: Text
comment: The modulation (e.g. FM, AM, etc) used by a particular broadcast service.
isPartOf: pending.schema.org

floorLimit
type: Property
isPartOf: pending.schema.org
comment: A floor limit is the amount of money above which credit card transactions must be authorized.
contributor: FIBO
domainIncludes: PaymentCard
source: https://github.com/schemaorg/schemaorg/issues/1253
rangeIncludes: MonetaryAmount

countryOfAssembly
type: Property
rangeIncludes: Text
domainIncludes: Product
isPartOf: pending.schema.org
comment: The place where the product was assembled.
source: https://github.com/schemaorg/schemaorg/issues/991
equivalent property: finalAssemblyCountry

typeOfGood
type: Property
contributor: GoodRelationsTerms
domainIncludes: TypeAndQuantityNode
domainIncludes: OwnershipInfo
rangeIncludes: Service
rangeIncludes: Product
comment: The product that this structured value is referring to.

applicationCategory
type: Property
rangeIncludes: Text
rangeIncludes: URL
comment: Type of software application, e.g. 'Game, Multimedia'.
domainIncludes: SoftwareApplication

founders
type: Property
comment: A person who founded this organization.
rangeIncludes: Person
supersededBy: founder
domainIncludes: Organization

founder
type: Property
domainIncludes: Organization
rangeIncludes: Organization
rangeIncludes: Person
comment: A person or organization who founded this organization.

diversityStaffingReport
type: Property
domainIncludes: Organization
domainIncludes: NewsMediaOrganization
source: https://github.com/schemaorg/schemaorg/issues/1525
contributor: TP
sub property of: publishingPrinciples
comment: For an Organization (often but not necessarily a NewsMediaOrganization), a report on staffing diversity issues. In a news context this might be for example ASNE or RTDNA (US) reports, or self-reported.
rangeIncludes: URL
rangeIncludes: Article
isPartOf: pending.schema.org

coach
type: Property
domainIncludes: SportsTeam
comment: A person that acts in a coaching role for a sports team.
rangeIncludes: Person

functionalClass
type: Property
rangeIncludes: MedicalEntity
rangeIncludes: Text
comment: The degree of mobility the joint allows.
isPartOf: health-lifesci.schema.org
domainIncludes: Joint

printPage
type: Property
comment: If this NewsArticle appears in print, this field indicates the name of the page on which the article is found. Please note that this field is intended for the exact page name (e.g. A5, B18).
domainIncludes: NewsArticle
rangeIncludes: Text

City
type: Class
comment: A city or town.
equivalent class: Municipality
subclass of: AdministrativeArea

sensoryUnit
type: Property
rangeIncludes: SuperficialAnatomy
rangeIncludes: AnatomicalStructure
comment: The neurological pathway extension that inputs and sends information to the brain or spinal cord.
isPartOf: health-lifesci.schema.org
domainIncludes: Nerve

returnFees
type: Property
comment: The type of return fees for purchased products (for any return reason).
rangeIncludes: ReturnFeesEnumeration
isPartOf: pending.schema.org
domainIncludes: MerchantReturnPolicySeasonalOverride
domainIncludes: MerchantReturnPolicy
source: https://github.com/schemaorg/schemaorg/issues/2288

secondaryPrevention
type: Property
rangeIncludes: Drug
rangeIncludes: DrugClass
rangeIncludes: MedicalTherapy
rangeIncludes: LifestyleModification
isPartOf: health-lifesci.schema.org
domainIncludes: MedicalCondition
comment: A preventative therapy used to prevent reoccurrence of the medical condition after an initial episode of the condition.

mobileUrl
type: Property
domainIncludes: Product
domainIncludes: Offer
rangeIncludes: Text
isPartOf: pending.schema.org
comment: The mobileUrl property is provided for specific situations in which data consumers need to determine whether one of several provided URLs is a dedicated 'mobile site'. To discourage over-use, and reflecting intial usecases, the property is expected only on Product and Offer, rather than Thing. The general trend in web technology is towards [responsive design](https://en.wikipedia.org/wiki/Responsive_web_design) in which content can be flexibly adapted to a wide range of browsing environments. Pages and sites referenced with the long-established url property should ideally also be usable on a wide variety of devices, including mobile phones. In most cases, it would be pointless and counter productive to attempt to update all url markup to use mobileUrl for more mobile-oriented pages. The property is intended for the case when items (primarily Product and Offer) have extra URLs hosted on an additional "mobile site" alongside the main one. It should not be taken as an endorsement of this publication style.
source: https://github.com/schemaorg/schemaorg/issues/3134

bitrate
type: Property
comment: The bitrate of the media object.
rangeIncludes: Text
domainIncludes: MediaObject

CausesHealthAspect
type: HealthAspectEnumeration
isPartOf: pending.schema.org
source: https://github.com/schemaorg/schemaorg/issues/2374
comment: Information about the causes and main actions that gave rise to the topic.

trailer
type: Property
domainIncludes: Movie
domainIncludes: VideoGameSeries
domainIncludes: Episode
domainIncludes: CreativeWorkSeason
domainIncludes: VideoGame
domainIncludes: MovieSeries
domainIncludes: TVSeries
domainIncludes: RadioSeries
rangeIncludes: VideoObject
comment: The trailer of a movie or TV/radio series, season, episode, etc.

MeetingRoom
type: Class
subclass of: Room
contributor: STI Accommodation Ontology
comment: A meeting room, conference room, or conference hall is a room provided for singular events such as business conferences and meetings (source: Wikipedia, the free encyclopedia, see http://en.wikipedia.org/wiki/Conference_hall). See also the dedicated document on the use of schema.org for marking up hotels and other forms of accommodations.

TierBenefitLoyaltyShipping
type: TierBenefitEnumeration
comment: Benefit of the tier is a members-only shipping price or speed (for example free shipping or 1-day shipping).
source: https://github.com/schemaorg/schemaorg/issues/3563
isPartOf: pending.schema.org

medicalAudience
type: Property
comment: Medical audience for page.
rangeIncludes: MedicalAudienceType
rangeIncludes: MedicalAudience
domainIncludes: MedicalWebPage
isPartOf: health-lifesci.schema.org

byMonth
type: Property
rangeIncludes: Integer
source: https://github.com/schemaorg/schemaorg/issues/1457
isPartOf: pending.schema.org
comment: Defines the month(s) of the year on which a recurring Event takes place. Specified as an Integer between 1-12. January is 1.
domainIncludes: Schedule

episodes
type: Property
domainIncludes: CreativeWorkSeason
domainIncludes: TVSeries
domainIncludes: RadioSeries
domainIncludes: VideoGameSeries
rangeIncludes: Episode
comment: An episode of a TV/radio series or season.
supersededBy: episode

episode
type: Property
sub property of: hasPart
domainIncludes: TVSeries
domainIncludes: RadioSeries
domainIncludes: VideoGameSeries
domainIncludes: CreativeWorkSeason
rangeIncludes: Episode
comment: An episode of a TV, radio or game media within a series or season.

variesBy
type: Property
domainIncludes: ProductGroup
rangeIncludes: DefinedTerm
rangeIncludes: Text
source: https://github.com/schemaorg/schemaorg/issues/1797
comment: Indicates the property or properties by which the variants in a ProductGroup vary, e.g. their size, color etc. Schema.org properties can be referenced by their short name e.g. "color"; terms defined elsewhere can be referenced with their URIs.
isPartOf: pending.schema.org

trailerWeight
type: Property
isPartOf: auto.schema.org
contributor: Automotive Ontology Working Group
rangeIncludes: QuantitativeValue
domainIncludes: Vehicle
comment: The permitted weight of a trailer attached to the vehicle.\n\nTypical unit code(s): KGM for kilogram, LBR for pound\n* Note 1: You can indicate additional information in the name of the QuantitativeValue node.\n* Note 2: You may also link to a QualitativeValue node that provides additional information using valueReference.\n* Note 3: Note that you can use minValue and maxValue to indicate ranges.

servicePostalAddress
type: Property
domainIncludes: ServiceChannel
sub property of: hasAddress
rangeIncludes: PostalAddress
comment: The address for accessing the service by mail.

Nonprofit501c7
type: USNonprofitType
source: https://github.com/schemaorg/schemaorg/issues/2543
comment: Nonprofit501c7: Non-profit type referring to Social and Recreational Clubs.
isPartOf: pending.schema.org

DecontextualizedContent
type: MediaManipulationRatingEnumeration
comment: Content coded 'missing context' in a MediaReview, considered in the context of how it was published or shared. For a VideoObject to be 'missing context': Presenting unaltered video in an inaccurate manner that misrepresents the footage. For example, using incorrect dates or locations, altering the transcript or sharing brief clips from a longer video to mislead viewers. (A video rated 'original' can also be missing context.) For an ImageObject to be 'missing context': Presenting unaltered images in an inaccurate manner to misrepresent the image and mislead the viewer. For example, a common tactic is using an unaltered image but saying it came from a different time or place. (An image rated 'original' can also be missing context.) For an ImageObject with embedded text to be 'missing context': An unaltered image presented in an inaccurate manner to misrepresent the image and mislead the viewer. For example, a common tactic is using an unaltered image but saying it came from a different time or place. (An 'original' image with inaccurate text would generally fall in this category.) For an AudioObject to be 'missing context': Unaltered audio presented in an inaccurate manner that misrepresents it. For example, using incorrect dates or locations, or sharing brief clips from a longer recording to mislead viewers. (Audio rated “original” can also be missing context.)
source: https://github.com/schemaorg/schemaorg/issues/2450
isPartOf: pending.schema.org

AdvertiserContentArticle
type: Class
source: https://github.com/schemaorg/schemaorg/issues/1525
contributor: TP
comment: An Article that an external entity has paid to place or to produce to its specifications. Includes [advertorials](https://en.wikipedia.org/wiki/Advertorial), sponsored content, native advertising and other paid content.
isPartOf: pending.schema.org
subclass of: Article

BodyMeasurementHips
type: BodyMeasurementTypeEnumeration
source: https://github.com/schemaorg/schemaorg/issues/2811
comment: Girth of hips (measured around the buttocks). Used, for example, to fit skirts.
isPartOf: pending.schema.org

liveBlogUpdate
type: Property
rangeIncludes: BlogPosting
domainIncludes: LiveBlogPosting
comment: An update to the LiveBlog.

DesktopWebPlatform
type: DigitalPlatformEnumeration
isPartOf: pending.schema.org
comment: Represents the broad notion of 'desktop' browsers as a Web Platform.
source: https://github.com/schemaorg/schemaorg/issues/3057

ticketedSeat
type: Property
comment: The seat associated with the ticket.
rangeIncludes: Seat
domainIncludes: Ticket

cvdNumVent
type: Property
comment: numvent - MECHANICAL VENTILATORS: Total number of ventilators available.
source: https://github.com/schemaorg/schemaorg/issues/2521
rangeIncludes: Number
domainIncludes: CDCPMDRecord
isPartOf: pending.schema.org

distance
type: Property
domainIncludes: ExerciseAction
domainIncludes: TravelAction
rangeIncludes: Distance
comment: The distance travelled, e.g. exercising or travelling.

loanPaymentAmount
type: Property
domainIncludes: RepaymentSpecification
contributor: FIBO
isPartOf: pending.schema.org
comment: The amount of money to pay in a single payment.
source: https://github.com/schemaorg/schemaorg/issues/1253
rangeIncludes: MonetaryAmount

yearsInOperation
type: Property
domainIncludes: BusinessAudience
rangeIncludes: QuantitativeValue
comment: The age of the business.

addressRegion
type: Property
domainIncludes: DefinedRegion
domainIncludes: PostalAddress
source: https://github.com/schemaorg/schemaorg/issues/2506
comment: The region in which the locality is, and which is in the country. For example, California or another appropriate first-level [Administrative division](https://en.wikipedia.org/wiki/List_of_administrative_divisions_by_country).
rangeIncludes: AdministrativeArea
rangeIncludes: Text
equivalent property: hasCountrySubdivision

contentType
type: Property
rangeIncludes: Text
domainIncludes: EntryPoint
comment: The supported content type(s) for an EntryPoint response.

itemShipped
type: Property
domainIncludes: ParcelDelivery
equivalent property: IncludedConsignmentItem
sub property of: hasProduct
rangeIncludes: Product
comment: Item(s) being shipped.

unnamedSourcesPolicy
type: Property
domainIncludes: Organization
domainIncludes: NewsMediaOrganization
rangeIncludes: CreativeWork
rangeIncludes: URL
comment: For an Organization (typically a NewsMediaOrganization), a statement about policy on use of unnamed sources and the decision process required.
sub property of: publishingPrinciples
source: https://github.com/schemaorg/schemaorg/issues/1525
isPartOf: pending.schema.org
contributor: TP

educationalUse
type: Property
comment: The purpose of a work in the context of education; for example, 'assignment', 'group work'.
rangeIncludes: Text
rangeIncludes: DefinedTerm
domainIncludes: CreativeWork
domainIncludes: LearningResource

ethicsPolicy
type: Property
domainIncludes: Organization
domainIncludes: NewsMediaOrganization
rangeIncludes: CreativeWork
rangeIncludes: URL
comment: Statement about ethics policy, e.g. of a NewsMediaOrganization regarding journalistic and publishing practices, or of a Restaurant, a page describing food source policies. In the case of a NewsMediaOrganization, an ethicsPolicy is typically a statement describing the personal, organizational, and corporate standards of behavior expected by the organization.
source: https://github.com/schemaorg/schemaorg/issues/1525
isPartOf: pending.schema.org

PrimaryCare
type: MedicalSpecialty
isPartOf: health-lifesci.schema.org
comment: The medical care by a physician, or other health-care professional, who is the patient's first contact with the health-care system and who may recommend a specialist if necessary.
subclass of: MedicalBusiness

membershipPointsEarned
type: Property
domainIncludes: ProgramMembership
domainIncludes: MemberProgramTier
domainIncludes: PriceSpecification
rangeIncludes: QuantitativeValue
rangeIncludes: Number
comment: The number of membership points earned by the member. If necessary, the unitText can be used to express the units the points are issued in. (E.g. stars, miles, etc.)
isPartOf: pending.schema.org
source: https://github.com/schemaorg/schemaorg/issues/2085

iataCode
type: Property
domainIncludes: Airport
domainIncludes: Airline
rangeIncludes: Text
comment: IATA identifier for an airline or airport.

title
type: Property
domainIncludes: JobPosting
rangeIncludes: Text
comment: The title of the job.

TripleBlindedTrial
type: MedicalTrialDesign
comment: A trial design in which neither the researcher, the person administering the therapy nor the patient knows the details of the treatment the patient was randomly assigned to.
isPartOf: health-lifesci.schema.org

xpath
type: Property
domainIncludes: SpeakableSpecification
domainIncludes: WebPageElement
rangeIncludes: XPathType
source: https://github.com/schemaorg/schemaorg/issues/1389
comment: An XPath, e.g. of a SpeakableSpecification or WebPageElement. In the latter case, multiple matches within a page can constitute a single conceptual "Web page element".

includedRiskFactor
type: Property
comment: A modifiable or non-modifiable risk factor included in the calculation, e.g. age, coexisting condition.
isPartOf: health-lifesci.schema.org
rangeIncludes: MedicalRiskFactor
domainIncludes: MedicalRiskEstimator

Dentistry
type: MedicalSpecialty
isPartOf: health-lifesci.schema.org
comment: A branch of medicine that is involved in the dental care.

ExhibitionEvent
type: Class
comment: Event type: Exhibition event, e.g. at a museum, library, archive, tradeshow, ...
subclass of: Event

colorSwatch
type: Property
domainIncludes: Product
sub property of: image
isPartOf: pending.schema.org
rangeIncludes: ImageObject
rangeIncludes: URL
source: https://github.com/schemaorg/schemaorg/issues/3423
comment: A color swatch image, visualizing the color of a Product. Should match the textual description specified in the color property. This can be a URL or a fully described ImageObject.

ItemPage
type: Class
subclass of: WebPage
comment: A page devoted to a single item, such as a particular product or hotel.

OrderInTransit
type: OrderStatus
comment: OrderStatus representing that an order is in transit.

course
type: Property
comment: A sub property of location. The course where this action was taken.
supersededBy: exerciseCourse
domainIncludes: ExerciseAction
rangeIncludes: Place
sub property of: location

exerciseCourse
type: Property
rangeIncludes: Place
domainIncludes: ExerciseAction
sub property of: location
comment: A sub property of location. The course where this action was taken.

broadcastSubChannel
type: Property
isPartOf: pending.schema.org
comment: The subchannel used for the broadcast.
rangeIncludes: Text
source: https://github.com/schemaorg/schemaorg/issues/2111
domainIncludes: BroadcastFrequencySpecification

accessCode
type: Property
rangeIncludes: Text
domainIncludes: DeliveryEvent
comment: Password, PIN, or access code needed for delivery (e.g. from a locker).

predecessorOf
type: Property
domainIncludes: ProductModel
comment: A pointer from a previous, often discontinued variant of the product to its newer variant.
rangeIncludes: ProductModel
contributor: GoodRelationsTerms

ViolenceConsideration
type: AdultOrientedEnumeration
comment: Item shows or promotes violence.
isPartOf: pending.schema.org
source: https://github.com/schemaorg/schemaorg/issues/2989

originalMediaContextDescription
type: Property
source: https://github.com/schemaorg/schemaorg/issues/2450
sub property of: description
rangeIncludes: Text
comment: Describes, in a MediaReview when dealing with DecontextualizedContent, background information that can contribute to better interpretation of the MediaObject.
isPartOf: pending.schema.org
domainIncludes: MediaReview

description
type: Property
comment: A description of the item.
equivalent property: description
rangeIncludes: TextObject
rangeIncludes: Text
domainIncludes: Thing

byMonthWeek
type: Property
source: https://github.com/schemaorg/schemaorg/issues/2599
comment: Defines the week(s) of the month on which a recurring Event takes place. Specified as an Integer between 1-5. For clarity, byMonthWeek is best used in conjunction with byDay to indicate concepts like the first and third Mondays of a month.
domainIncludes: Schedule
rangeIncludes: Integer
isPartOf: pending.schema.org

isFamilyFriendly
type: Property
domainIncludes: Offer
domainIncludes: Product
domainIncludes: CreativeWork
comment: Indicates whether this content is family friendly.
rangeIncludes: Boolean

Obstetric
type: MedicalSpecialty
subclass of: MedicalBusiness
comment: A specific branch of medical science that specializes in the care of women during the prenatal and postnatal care and with the delivery of the child.
isPartOf: health-lifesci.schema.org

CheckoutPage
type: Class
subclass of: WebPage
comment: Web page type: Checkout page.

dataFeedElement
type: Property
rangeIncludes: DataFeedItem
rangeIncludes: Thing
rangeIncludes: Text
comment: An item within a data feed. Data feeds may have many elements.
domainIncludes: DataFeed

InternetCafe
type: Class
comment: An internet cafe.
subclass of: LocalBusiness

opponent
type: Property
domainIncludes: ExerciseAction
sub property of: participant
rangeIncludes: Person
comment: A sub property of participant. The opponent on this action.

accountMinimumInflow
type: Property
rangeIncludes: MonetaryAmount
comment: A minimum amount that has to be paid in every month.
contributor: FIBO
isPartOf: pending.schema.org
source: https://github.com/schemaorg/schemaorg/issues/1253
domainIncludes: BankAccount

speed
type: Property
contributor: Automotive Ontology Working Group
domainIncludes: Vehicle
comment: The speed range of the vehicle. If the vehicle is powered by an engine, the upper limit of the speed range (indicated by maxValue) should be the maximum speed achievable under regular conditions.\n\nTypical unit code(s): KMH for km/h, HM for mile per hour (0.447 04 m/s), KNT for knot\n\n*Note 1: Use minValue and maxValue to indicate the range. Typically, the minimal value is zero.\n* Note 2: There are many different ways of measuring the speed range. You can link to information about how the given value has been determined using the valueReference property.
rangeIncludes: QuantitativeValue
isPartOf: auto.schema.org

usNPI
type: Property
rangeIncludes: Text
source: https://github.com/schemaorg/schemaorg/issues/3420
comment: A National Provider Identifier (NPI) is a unique 10-digit identification number issued to health care providers in the United States by the Centers for Medicare and Medicaid Services.
isPartOf: pending.schema.org
sub property of: identifier
domainIncludes: Physician

courseWorkload
type: Property
source: https://github.com/schemaorg/schemaorg/issues/1909
comment: The amount of work expected of students taking the course, often provided as a figure per week or per month, and may be broken down by type. For example, "2 hours of lectures, 1 hour of lab work and 3 hours of independent study per week".
rangeIncludes: Text
domainIncludes: CourseInstance
isPartOf: pending.schema.org

IncentiveTypeTaxDeduction
type: IncentiveType
comment: An incentive that reduces the recipient's amount of taxable income.
isPartOf: pending.schema.org
source: https://github.com/schemaorg/schemaorg/issues/3572

purchasePriceLimit
type: Property
rangeIncludes: MonetaryAmount
isPartOf: pending.schema.org
source: https://github.com/schemaorg/schemaorg/issues/3572
comment: Optional. The maximum price the item can have and still qualify for this offer.
domainIncludes: FinancialIncentive

CrossSectional
type: MedicalObservationalStudyDesign
isPartOf: health-lifesci.schema.org
comment: Studies carried out on pre-existing data (usually from 'snapshot' surveys), such as that collected by the Census Bureau. Sometimes called Prevalence Studies.

FDAnotEvaluated
type: DrugPregnancyCategory
isPartOf: health-lifesci.schema.org
comment: A designation that the drug in question has not been assigned a pregnancy category designation by the US FDA.

MarryAction
type: Class
subclass of: InteractAction
comment: The act of marrying a person.

EventMovedOnline
type: EventStatusType
comment: Indicates that the event was changed to allow online participation. See eventAttendanceMode for specifics of whether it is now fully or partially online.

geoOverlaps
type: Property
domainIncludes: GeospatialGeometry
domainIncludes: Place
rangeIncludes: GeospatialGeometry
rangeIncludes: Place
comment: Represents a relationship between two geometries (or the places they represent), relating a geometry to another that geospatially overlaps it, i.e. they have some but not all points in common. As defined in [DE-9IM](https://en.wikipedia.org/wiki/DE-9IM).

TrainedAlgorithmicMediaDigitalSource
type: IPTCDigitalSourceEnumeration
isPartOf: pending.schema.org
comment: Content coded as 'trained algorithmic media' using the IPTC digital source type vocabulary.
source: https://github.com/schemaorg/schemaorg/issues/3392

PaymentService
type: Class
contributor: FIBO
subclass of: FinancialProduct
subclass of: PaymentMethod
equivalent class: PaymentService
comment: A Service to transfer funds from a person or organization to a beneficiary person or organization.

Hematologic
type: MedicalSpecialty
isPartOf: health-lifesci.schema.org
comment: A specific branch of medical science that pertains to diagnosis and treatment of disorders of blood and blood producing organs.

BenefitsHealthAspect
type: HealthAspectEnumeration
comment: Content about the benefits and advantages of usage or utilization of topic.
source: https://github.com/schemaorg/schemaorg/issues/2374
isPartOf: pending.schema.org

IncentiveTypeTaxWaiver
type: IncentiveType
comment: An incentive that reduces/exempts the recipient from taxation applicable to the incentivized good/service (e.g. luxury taxes, registration taxes, circulation tax).
isPartOf: pending.schema.org
source: https://github.com/schemaorg/schemaorg/issues/3572

IngredientsHealthAspect
type: HealthAspectEnumeration
source: https://github.com/schemaorg/schemaorg/issues/2799
isPartOf: pending.schema.org
comment: Content discussing ingredients-related aspects of a health topic.

OneTimePayments
type: GovernmentBenefitsType
comment: OneTimePayments: this is a benefit for one-time payments for individuals.
isPartOf: pending.schema.org
source: https://github.com/schemaorg/schemaorg/issues/2534

guidelineDate
type: Property
isPartOf: health-lifesci.schema.org
domainIncludes: MedicalGuideline
comment: Date on which this guideline's recommendation was made.
rangeIncludes: Date

Notary
type: Class
comment: A notary.
subclass of: LegalService

openingHoursSpecification
type: Property
domainIncludes: Place
rangeIncludes: OpeningHoursSpecification
contributor: GoodRelationsTerms
comment: The opening hours of a certain place.

originalMediaLink
type: Property
domainIncludes: MediaReview
comment: Link to the page containing an original version of the content, or directly to an online copy of the original MediaObject content, e.g. video file.
source: https://github.com/schemaorg/schemaorg/issues/2450
rangeIncludes: WebPage
rangeIncludes: MediaObject
rangeIncludes: URL
isPartOf: pending.schema.org

itemReviewed
type: Property
domainIncludes: Review
domainIncludes: AggregateRating
comment: The item that is being reviewed/rated.
rangeIncludes: Thing

DemoAlbum
type: MusicAlbumProductionType
comment: DemoAlbum.
contributor: MBZ

logo
type: Property
domainIncludes: Organization
domainIncludes: Product
domainIncludes: Certification
domainIncludes: Brand
domainIncludes: Place
domainIncludes: Service
contributor: GoodRelationsTerms
rangeIncludes: URL
rangeIncludes: ImageObject
comment: An associated logo.
equivalent property: logoReferencedDocument
sub property of: image

BodyMeasurementHeight
type: BodyMeasurementTypeEnumeration
source: https://github.com/schemaorg/schemaorg/issues/2811
isPartOf: pending.schema.org
comment: Body height (measured between crown of head and soles of feet). Used, for example, to fit jackets.

customerRemorseReturnFees
type: Property
source: https://github.com/schemaorg/schemaorg/issues/2880
comment: The type of return fees if the product is returned due to customer remorse.
rangeIncludes: ReturnFeesEnumeration
isPartOf: pending.schema.org
domainIncludes: MerchantReturnPolicy

ShortStory
type: Class
isPartOf: pending.schema.org
source: https://github.com/schemaorg/schemaorg/issues/1976
subclass of: CreativeWork
comment: Short story or tale. A brief work of literature, usually written in narrative prose.

children
type: Property
comment: A child of the person.
rangeIncludes: Person
domainIncludes: Person

seasonNumber
type: Property
comment: Position of the season within an ordered group of seasons.
sub property of: position
rangeIncludes: Text
rangeIncludes: Integer
domainIncludes: CreativeWorkSeason

legislationPassedBy
type: Property
contributor: ELI
equivalent property: passed by
source: eli
source: https://github.com/schemaorg/schemaorg/issues/1156
isPartOf: pending.schema.org
rangeIncludes: Organization
rangeIncludes: Person
comment: The person or organization that originally passed or made the law: typically parliament (for primary legislation) or government (for secondary legislation). This indicates the "legal author" of the law, as opposed to its physical author.
sub property of: creator
domainIncludes: Legislation

creator
type: Property
domainIncludes: UserComments
domainIncludes: CreativeWork
comment: The creator/author of this CreativeWork. This is the same as the Author property for CreativeWork.
rangeIncludes: Person
rangeIncludes: Organization

serviceAudience
type: Property
domainIncludes: Service
rangeIncludes: Audience
comment: The audience eligible for this service.
supersededBy: audience

audience
type: Property
domainIncludes: Service
domainIncludes: PlayAction
domainIncludes: LodgingBusiness
domainIncludes: Product
domainIncludes: Event
domainIncludes: CreativeWork
comment: An intended audience, i.e. a group for whom something was created.
rangeIncludes: Audience

starRating
type: Property
domainIncludes: FoodEstablishment
domainIncludes: LodgingBusiness
comment: An official rating for a lodging business or food establishment, e.g. from national associations or standards bodies. Use the author property to indicate the rating organization, e.g. as an Organization with name such as (e.g. HOTREC, DEHOGA, WHR, or Hotelstars).
contributor: STI Accommodation Ontology
rangeIncludes: Rating

FundingScheme
type: Class
source: FundInfoCollab
source: https://github.com/schemaorg/schemaorg/issues/383
subclass of: Organization
isPartOf: pending.schema.org
comment: A FundingScheme combines organizational, project and policy aspects of grant-based funding that sets guidelines, principles and mechanisms to support other kinds of projects and activities. Funding is typically organized via Grant funding. Examples of funding schemes: Swiss Priority Programmes (SPPs); EU Framework 7 (FP7); Horizon 2020; the NIH-R01 Grant Program; Wellcome institutional strategic support fund. For large scale public sector funding, the management and administration of grant awards is often handled by other, dedicated, organizations - FundingAgencys such as ERC, REA, ...

arrivalTime
type: Property
domainIncludes: Trip
rangeIncludes: DateTime
rangeIncludes: Time
comment: The expected arrival time.

sameAs
type: Property
domainIncludes: Thing
comment: URL of a reference Web page that unambiguously indicates the item's identity. E.g. the URL of the item's Wikipedia page, Wikidata entry, or official website.
rangeIncludes: URL

termsPerYear
type: Property
rangeIncludes: Number
domainIncludes: EducationalOccupationalProgram
isPartOf: pending.schema.org
comment: The number of times terms of study are offered per year. Semesters and quarters are common units for term. For example, if the student can only take 2 semesters for the program in one year, then termsPerYear should be 2.
source: https://github.com/schemaorg/schemaorg/issues/2419

sdDatePublished
type: Property
source: https://github.com/schemaorg/schemaorg/issues/1886
comment: Indicates the date on which the current structured data was generated / published. Typically used alongside sdPublisher.
domainIncludes: CreativeWork
isPartOf: pending.schema.org
rangeIncludes: Date

isAvailableGenerically
type: Property
rangeIncludes: Boolean
domainIncludes: Drug
comment: True if the drug is available in a generic form (regardless of name).
isPartOf: health-lifesci.schema.org

dateModified
type: Property
domainIncludes: DataFeedItem
domainIncludes: CreativeWork
rangeIncludes: Date
rangeIncludes: DateTime
comment: The date on which the CreativeWork was most recently modified or when the item's entry was modified within a DataFeed.

Chiropractic
type: MedicineSystem
isPartOf: health-lifesci.schema.org
comment: A system of medicine focused on the relationship between the body's structure, mainly the spine, and its functioning.

healthPlanCopay
type: Property
rangeIncludes: PriceSpecification
domainIncludes: HealthPlanCostSharingSpecification
source: https://github.com/schemaorg/schemaorg/issues/1062
comment: The copay amount.
isPartOf: pending.schema.org

successorOf
type: Property
rangeIncludes: ProductModel
contributor: GoodRelationsTerms
comment: A pointer from a newer variant of a product to its previous, often discontinued predecessor.
domainIncludes: ProductModel

ReturnAtKiosk
type: ReturnMethodEnumeration
comment: Specifies that product returns must be made at a kiosk.
isPartOf: pending.schema.org
source: https://github.com/schemaorg/schemaorg/issues/2880

telephone
type: Property
equivalent property: telephone
domainIncludes: Place
domainIncludes: ContactPoint
domainIncludes: Person
domainIncludes: Organization
comment: The telephone number.
rangeIncludes: Text

engineType
type: Property
rangeIncludes: URL
rangeIncludes: Text
rangeIncludes: QualitativeValue
domainIncludes: EngineSpecification
comment: The type of engine or engines powering the vehicle.
isPartOf: auto.schema.org
contributor: Automotive Ontology Working Group

taxonomicRange
type: Property
domainIncludes: BioChemEntity
isPartOf: pending.schema.org
rangeIncludes: Taxon
rangeIncludes: DefinedTerm
rangeIncludes: URL
rangeIncludes: Text
source: www.bioschemas.org
comment: The taxonomic grouping of the organism that expresses, encodes, or in some way related to the BioChemEntity.

diversityPolicy
type: Property
rangeIncludes: CreativeWork
rangeIncludes: URL
domainIncludes: Organization
domainIncludes: NewsMediaOrganization
comment: Statement on diversity policy by an Organization e.g. a NewsMediaOrganization. For a NewsMediaOrganization, a statement describing the newsroom’s diversity policy on both staffing and sources, typically providing staffing data.
source: https://github.com/schemaorg/schemaorg/issues/1525
contributor: TP
isPartOf: pending.schema.org

hasCertification
type: Property
rangeIncludes: Certification
sub property of: isReferencedIn
sub property of: isClassifiedBy
domainIncludes: Place
domainIncludes: Service
domainIncludes: Person
domainIncludes: Organization
domainIncludes: Product
source: https://github.com/schemaorg/schemaorg/issues/3230
equivalent property: ApplicableCertificate
comment: Certification information about a product, organization, service, place, or person.

Motorcycle
type: Class
comment: A motorcycle or motorbike is a single-track, two-wheeled motor vehicle.
subclass of: Vehicle
contributor: Automotive Ontology Working Group
isPartOf: auto.schema.org

interactingDrug
type: Property
rangeIncludes: Drug
isPartOf: health-lifesci.schema.org
comment: Another drug that is known to interact with this drug in a way that impacts the effect of this drug or causes a risk to the patient. Note: disease interactions are typically captured as contraindications.
domainIncludes: Drug

documentation
type: Property
rangeIncludes: URL
rangeIncludes: CreativeWork
source: https://github.com/schemaorg/schemaorg/issues/1423
comment: Further documentation describing the Web API in more detail.
isPartOf: pending.schema.org
domainIncludes: WebAPI

broadcastAffiliateOf
type: Property
comment: The media network(s) whose content is broadcast on this station.
domainIncludes: BroadcastService
rangeIncludes: Organization

WearAction
type: Class
comment: The act of dressing oneself in clothing.
subclass of: UseAction

processorRequirements
type: Property
rangeIncludes: Text
domainIncludes: SoftwareApplication
comment: Processor architecture required to run the application (e.g. IA64).

currency
type: Property
source: https://github.com/schemaorg/schemaorg/issues/1253
domainIncludes: DatedMoneySpecification
domainIncludes: MonetaryAmount
domainIncludes: MonetaryAmountDistribution
domainIncludes: ExchangeRateSpecification
domainIncludes: LoanOrCredit
comment: The currency in which the monetary amount is expressed.\n\nUse standard formats: [ISO 4217 currency format](http://en.wikipedia.org/wiki/ISO_4217), e.g. "USD"; [Ticker symbol](https://en.wikipedia.org/wiki/List_of_cryptocurrencies) for cryptocurrencies, e.g. "BTC"; well known names for [Local Exchange Trading Systems](https://en.wikipedia.org/wiki/Local_exchange_trading_system) (LETS) and other currency types, e.g. "Ithaca HOUR".
rangeIncludes: Text
equivalent property: hasCurrency

gameLocation
type: Property
rangeIncludes: URL
rangeIncludes: Place
rangeIncludes: PostalAddress
comment: Real or fictional location of the game (or part of game).
domainIncludes: Game
domainIncludes: VideoGameSeries

isUnlabelledFallback
type: Property
domainIncludes: ShippingRateSettings
domainIncludes: DeliveryTimeSettings
rangeIncludes: Boolean
source: https://github.com/schemaorg/schemaorg/issues/2506
comment: This can be marked 'true' to indicate that some published DeliveryTimeSettings or ShippingRateSettings are intended to apply to all OfferShippingDetails published by the same merchant, when referenced by a shippingSettingsLink in those settings. It is not meaningful to use a 'true' value for this property alongside a transitTimeLabel (for DeliveryTimeSettings) or shippingLabel (for ShippingRateSettings), since this property is for use with unlabelled settings.

hasStore
type: Property
isPartOf: pending.schema.org
comment: An eCommerce store part of an online marketplace.
source: https://github.com/schemaorg/schemaorg/issues/4470
domainIncludes: OnlineMarketplace
rangeIncludes: OnlineStore

partOfTVSeries
type: Property
domainIncludes: TVClip
domainIncludes: TVSeason
domainIncludes: TVEpisode
supersededBy: partOfSeries
sub property of: isPartOf
comment: The TV series to which this episode or season belongs.
rangeIncludes: TVSeries

partOfSeries
type: Property
domainIncludes: Clip
domainIncludes: Episode
domainIncludes: CreativeWorkSeason
rangeIncludes: CreativeWorkSeries
sub property of: isPartOf
comment: The series to which this episode or season belongs.

maxPrice
type: Property
domainIncludes: PriceSpecification
sub property of: hasUpperBound
sub property of: hasMonetaryAmount
contributor: GoodRelationsTerms
comment: The highest price if the price is a range.
rangeIncludes: Number

accessibilityHazard
type: Property
domainIncludes: CreativeWork
comment: A characteristic of the described resource that is physiologically dangerous to some users. Related to WCAG 2.0 guideline 2.3. Values should be drawn from the [approved vocabulary](https://www.w3.org/2021/a11y-discov-vocab/latest/#accessibilityHazard-vocabulary).
rangeIncludes: Text

underName
type: Property
domainIncludes: Ticket
domainIncludes: Reservation
rangeIncludes: Person
rangeIncludes: Organization
comment: The person or organization the reservation or ticket is for.

inBroadcastLineup
type: Property
rangeIncludes: CableOrSatelliteService
domainIncludes: BroadcastChannel
comment: The CableOrSatelliteService offering the channel.

accessibilityFeature
type: Property
comment: Content features of the resource, such as accessible media, alternatives and supported enhancements for accessibility. Values should be drawn from the [approved vocabulary](https://www.w3.org/2021/a11y-discov-vocab/latest/#accessibilityFeature-vocabulary).
rangeIncludes: Text
domainIncludes: CreativeWork

byArtist
type: Property
domainIncludes: MusicAlbum
domainIncludes: MusicRecording
rangeIncludes: Person
rangeIncludes: MusicGroup
comment: The artist that performed this album or recording.

InstallAction
type: Class
comment: The act of installing an application.
subclass of: ConsumeAction

suggestedMaxAge
type: Property
comment: Maximum recommended age in years for the audience or user.
rangeIncludes: Number
domainIncludes: PeopleAudience

EUEnergyEfficiencyCategoryD
type: EUEnergyEfficiencyEnumeration
isPartOf: pending.schema.org
source: https://github.com/schemaorg/schemaorg/issues/2670
comment: Represents EU Energy Efficiency Class D as defined in EU energy labeling regulations.

isProprietary
type: Property
isPartOf: health-lifesci.schema.org
rangeIncludes: Boolean
domainIncludes: DietarySupplement
domainIncludes: Drug
comment: True if this item's name is a proprietary/brand name (vs. generic name).

codingSystem
type: Property
rangeIncludes: Text
isPartOf: health-lifesci.schema.org
domainIncludes: MedicalCode
comment: The coding system, e.g. 'ICD-10'.

renegotiableLoan
type: Property
comment: Whether the terms for payment of interest can be renegotiated during the life of the loan.
contributor: FIBO
isPartOf: pending.schema.org
rangeIncludes: Boolean
source: https://github.com/schemaorg/schemaorg/issues/1253
domainIncludes: LoanOrCredit

businessFunction
type: Property
domainIncludes: Demand
domainIncludes: Offer
domainIncludes: TypeAndQuantityNode
rangeIncludes: BusinessFunction
contributor: GoodRelationsTerms
comment: The business function (e.g. sell, lease, repair, dispose) of the offer or component of a bundle (TypeAndQuantityNode). The default is http://purl.org/goodrelations/v1#Sell.

physicalRequirement
type: Property
rangeIncludes: DefinedTerm
rangeIncludes: URL
rangeIncludes: Text
source: https://github.com/schemaorg/schemaorg/issues/2384
comment: A description of the types of physical activity associated with the job. Defined terms such as those in O*net may be used, but note that there is no way to specify the level of ability as well as its nature when using a defined term.
domainIncludes: JobPosting
isPartOf: pending.schema.org

deliveryMethod
type: Property
domainIncludes: SendAction
domainIncludes: ReceiveAction
domainIncludes: OrderAction
domainIncludes: TrackAction
sub property of: instrument
comment: A sub property of instrument. The method of delivery.
rangeIncludes: DeliveryMethod

jobLocation
type: Property
comment: A (typically single) geographic location associated with the job position.
domainIncludes: JobPosting
rangeIncludes: Place

ConvenienceStore
type: Class
comment: A convenience store.
subclass of: Store

byDay
type: Property
rangeIncludes: Text
rangeIncludes: DayOfWeek
source: https://github.com/schemaorg/schemaorg/issues/1457
comment: Defines the day(s) of the week on which a recurring Event takes place. May be specified using either DayOfWeek, or alternatively Text conforming to iCal's syntax for byDay recurrence rules.
isPartOf: pending.schema.org
domainIncludes: Schedule

subTest
type: Property
isPartOf: health-lifesci.schema.org
comment: A component test of the panel.
rangeIncludes: MedicalTest
domainIncludes: MedicalTestPanel

seasonalOverride
type: Property
source: https://github.com/schemaorg/schemaorg/issues/3617
comment: Limited period during which these shipping conditions apply.
domainIncludes: ShippingConditions
isPartOf: pending.schema.org
rangeIncludes: OpeningHoursSpecification

BookStore
type: Class
comment: A bookstore.
subclass of: Store

directors
type: Property
domainIncludes: Movie
domainIncludes: VideoGameSeries
domainIncludes: Clip
domainIncludes: Episode
domainIncludes: VideoGame
domainIncludes: MovieSeries
domainIncludes: VideoObject
domainIncludes: TVSeries
domainIncludes: RadioSeries
comment: A director of e.g. TV, radio, movie, video games etc. content. Directors can be associated with individual items or with a series, episode, clip.
rangeIncludes: Person
supersededBy: director

director
type: Property
domainIncludes: Movie
domainIncludes: VideoGameSeries
domainIncludes: Event
domainIncludes: VideoGame
domainIncludes: MovieSeries
domainIncludes: Clip
domainIncludes: Episode
domainIncludes: CreativeWorkSeason
domainIncludes: VideoObject
domainIncludes: RadioSeries
domainIncludes: TVSeries
rangeIncludes: Person
comment: A director of e.g. TV, radio, movie, video gaming etc. content, or of an event. Directors can be associated with individual items or with a series, episode, clip.

reservedTicket
type: Property
rangeIncludes: Ticket
domainIncludes: Reservation
comment: A ticket associated with the reservation.

Skin
type: PhysicalExam
isPartOf: health-lifesci.schema.org
comment: Skin assessment with clinical examination.

reviewAspect
type: Property
domainIncludes: Guide
domainIncludes: Rating
domainIncludes: Review
rangeIncludes: Text
rangeIncludes: StructuredValue
comment: This Review or Rating is relevant to this part or facet of the itemReviewed.
source: https://github.com/schemaorg/schemaorg/issues/1689

possibleTreatment
type: Property
domainIncludes: MedicalCondition
domainIncludes: MedicalSignOrSymptom
rangeIncludes: Drug
rangeIncludes: DrugClass
rangeIncludes: MedicalTherapy
rangeIncludes: LifestyleModification
isPartOf: health-lifesci.schema.org
comment: A possible treatment to address this condition, sign or symptom.

hasCourseInstance
type: Property
comment: An offering of the course at a specific time and place or through specific media or mode of study or to a specific section of students.
domainIncludes: Course
rangeIncludes: CourseInstance

preOp
type: Property
domainIncludes: MedicalDevice
comment: A description of the workup, testing, and other preparations required before implanting this device.
isPartOf: health-lifesci.schema.org
rangeIncludes: Text

muscleAction
type: Property
domainIncludes: Muscle
rangeIncludes: Text
comment: The movement the muscle generates.
isPartOf: health-lifesci.schema.org

agent
type: Property
rangeIncludes: Organization
rangeIncludes: Person
domainIncludes: Action
comment: The direct performer or driver of the action (animate or inanimate). E.g. *John* wrote a book.

proprietaryName
type: Property
domainIncludes: Drug
domainIncludes: DietarySupplement
comment: Proprietary name given to the diet plan, typically by its originator or creator.
rangeIncludes: Text
isPartOf: health-lifesci.schema.org

character
type: Property
rangeIncludes: Person
comment: Fictional person connected with a creative work.
domainIncludes: CreativeWork

playerType
type: Property
comment: Player type required—for example, Flash or Silverlight.
domainIncludes: MediaObject
rangeIncludes: Text

gtin13
type: Property
contributor: GoodRelationsTerms
rangeIncludes: Text
domainIncludes: Product
domainIncludes: Demand
domainIncludes: Offer
sub property of: gtin
sub property of: identifier
comment: The GTIN-13 code of the product, or the product to which the offer refers. This is equivalent to 13-digit ISBN codes and EAN UCC-13. Former 12-digit UPC codes can be converted into a GTIN-13 code by simply adding a preceding zero. See [GS1 GTIN Summary](http://www.gs1.org/barcodes/technical/idkeys/gtin) for more details.

gtin
type: Property
domainIncludes: Product
domainIncludes: Demand
domainIncludes: Offer
isPartOf: pending.schema.org
rangeIncludes: Text
rangeIncludes: URL
comment: A Global Trade Item Number ([GTIN](https://www.gs1.org/standards/id-keys/gtin)). GTINs identify trade items, including products and services, using numeric identification codes. A correct gtin value should be a valid GTIN, which means that it should be an all-numeric string of either 8, 12, 13 or 14 digits, or a "GS1 Digital Link" URL based on such a string. The numeric component should also have a [valid GS1 check digit](https://www.gs1.org/services/check-digit-calculator) and meet the other rules for valid GTINs. See also [GS1's GTIN Summary](http://www.gs1.org/barcodes/technical/idkeys/gtin) and [Wikipedia](https://en.wikipedia.org/wiki/Global_Trade_Item_Number) for more details. Left-padding of the gtin values is not required or encouraged. The gtin property generalizes the earlier gtin8, gtin12, gtin13, and gtin14 properties. The GS1 [digital link specifications](https://www.gs1.org/standards/Digital-Link/) expresses GTINs as URLs (URIs, IRIs, etc.). Digital Links should be populated into the hasGS1DigitalLink attribute. Note also that this is a definition for how to include GTINs in Schema.org data, and not a definition of GTINs in general - see the GS1 documentation for authoritative details.
equivalent property: gtin
equivalent property: gTINId
sub property of: identifier
source: https://github.com/schemaorg/schemaorg/issues/2288

landlord
type: Property
comment: A sub property of participant. The owner of the real estate property.
domainIncludes: RentAction
sub property of: participant
rangeIncludes: Organization
rangeIncludes: Person

gtin14
type: Property
domainIncludes: Offer
domainIncludes: Product
domainIncludes: Demand
comment: The GTIN-14 code of the product, or the product to which the offer refers. See [GS1 GTIN Summary](http://www.gs1.org/barcodes/technical/idkeys/gtin) for more details.
contributor: GoodRelationsTerms
rangeIncludes: Text
sub property of: gtin
sub property of: identifier

valueName
type: Property
comment: Indicates the name of the PropertyValueSpecification to be used in URL templates and form encoding in a manner analogous to HTML's input@name.
rangeIncludes: Text
domainIncludes: PropertyValueSpecification

Newspaper
type: Class
subclass of: Periodical
source: Newspaper
isPartOf: bib.schema.org
comment: A publication containing information about varied topics that are pertinent to general information, a geographic area, or a specific subject matter (i.e. business, culture, education). Often published daily.

videoFrameSize
type: Property
rangeIncludes: Text
comment: The frame size of the video.
domainIncludes: VideoObject

associatedAnatomy
type: Property
comment: The anatomy of the underlying organ system or structures associated with this entity.
isPartOf: health-lifesci.schema.org
rangeIncludes: SuperficialAnatomy
rangeIncludes: AnatomicalStructure
rangeIncludes: AnatomicalSystem
domainIncludes: PhysicalActivity
domainIncludes: MedicalCondition

size
type: Property
comment: A standardized size of a product or creative work, specified either through a simple textual string (for example 'XL', '32Wx34L'), a QuantitativeValue with a unitCode, or a comprehensive and structured SizeSpecification; in other cases, the width, height, depth and weight properties may be more applicable.
rangeIncludes: QuantitativeValue
rangeIncludes: Text
rangeIncludes: DefinedTerm
rangeIncludes: SizeSpecification
domainIncludes: Product
domainIncludes: CreativeWork
isPartOf: pending.schema.org
source: https://github.com/schemaorg/schemaorg/issues/1797
equivalent property: sizeDescription

pickupTime
type: Property
rangeIncludes: DateTime
comment: When a taxi will pick up a passenger or a rental car can be picked up.
domainIncludes: TaxiReservation
domainIncludes: RentalCarReservation

ReportageNewsArticle
type: Class
source: https://github.com/schemaorg/schemaorg/issues/1525
comment: The ReportageNewsArticle type is a subtype of NewsArticle representing news articles which are the result of journalistic news reporting conventions. In practice many news publishers produce a wide variety of article types, many of which might be considered a NewsArticle but not a ReportageNewsArticle. For example, opinion pieces, reviews, analysis, sponsored or satirical articles, or articles that combine several of these elements. The ReportageNewsArticle type is based on a stricter ideal for "news" as a work of journalism, with articles based on factual information either observed or verified by the author, or reported and verified from knowledgeable sources. This often includes perspectives from multiple viewpoints on a particular issue (distinguishing news reports from public relations or propaganda). News reports in the ReportageNewsArticle sense de-emphasize the opinion of the author, with commentary and value judgements typically expressed elsewhere. A ReportageNewsArticle which goes deeper into analysis can also be marked with an additional type of AnalysisNewsArticle.
contributor: TP
isPartOf: pending.schema.org
subclass of: NewsArticle

FulfillmentTypeCollectionPoint
type: FulfillmentTypeEnumeration
source: https://github.com/schemaorg/schemaorg/issues/3617
isPartOf: pending.schema.org
comment: Fulfillment to a collection point location.

utterances
type: Property
source: https://github.com/schemaorg/schemaorg/issues/2766
isPartOf: pending.schema.org
domainIncludes: HyperTocEntry
rangeIncludes: Text
comment: Text of an utterances (spoken words, lyrics etc.) that occurs at a certain section of a media object, represented as a HyperTocEntry.

homeLocation
type: Property
rangeIncludes: Place
rangeIncludes: ContactPoint
comment: A contact location for a person's residence.
sub property of: location
domainIncludes: Person

EventPostponed
type: EventStatusType
comment: The event has been postponed and no new date has been set. The event's previousStartDate should be set.

gracePeriod
type: Property
rangeIncludes: Duration
comment: The period of time after any due date that the borrower has to fulfil its obligations before a default (failure to pay) is deemed to have occurred.
source: https://github.com/schemaorg/schemaorg/issues/1253
domainIncludes: LoanOrCredit
contributor: FIBO
isPartOf: pending.schema.org

SelfStorage
type: Class
subclass of: LocalBusiness
comment: A self-storage facility.

funder
type: Property
domainIncludes: CreativeWork
domainIncludes: MonetaryGrant
domainIncludes: Person
domainIncludes: Organization
domainIncludes: Grant
domainIncludes: Event
rangeIncludes: Organization
rangeIncludes: Person
comment: A person or organization that supports (sponsors) something through some kind of financial contribution.
sub property of: sponsor

sponsor
type: Property
rangeIncludes: Person
rangeIncludes: Organization
domainIncludes: MedicalStudy
domainIncludes: Event
domainIncludes: CreativeWork
domainIncludes: Person
domainIncludes: Organization
domainIncludes: Grant
comment: A person or organization that supports a thing through a pledge, promise, or financial contribution. E.g. a sponsor of a Medical Study or a corporate sponsor of an event.

materialExtent
type: Property
source: https://github.com/schemaorg/schemaorg/issues/1759
rangeIncludes: QuantitativeValue
rangeIncludes: Text
comment: The quantity of the materials being described or an expression of the physical space they occupy.
domainIncludes: CreativeWork
isPartOf: pending.schema.org

schoolClosuresInfo
type: Property
rangeIncludes: URL
rangeIncludes: WebContent
comment: Information about school closures.
isPartOf: pending.schema.org
source: https://github.com/schemaorg/schemaorg/issues/2490
domainIncludes: SpecialAnnouncement

resultComment
type: Property
domainIncludes: ReplyAction
domainIncludes: CommentAction
comment: A sub property of result. The Comment created or sent as a result of this action.
sub property of: result
rangeIncludes: Comment

result
type: Property
comment: The result produced in the action. E.g. John wrote *a book*.
rangeIncludes: Thing
domainIncludes: Action

VegetarianDiet
type: RestrictedDiet
comment: A diet exclusive of animal meat.

applicableCountry
type: Property
source: https://github.com/schemaorg/schemaorg/issues/3001
rangeIncludes: Country
rangeIncludes: Text
comment: A country where a particular merchant return policy applies to, for example the two-letter ISO 3166-1 alpha-2 country code.
domainIncludes: MerchantReturnPolicy
isPartOf: pending.schema.org

OutOfStock
type: ItemAvailability
comment: Indicates that the item is out of stock.

credentialCategory
type: Property
domainIncludes: EducationalOccupationalCredential
comment: The category or type of credential being described, for example "degree”, “certificate”, “badge”, or more specific term.
rangeIncludes: DefinedTerm
rangeIncludes: URL
rangeIncludes: Text
isPartOf: pending.schema.org
source: https://github.com/schemaorg/schemaorg/issues/1779

returnPolicySeasonalOverride
type: Property
domainIncludes: MerchantReturnPolicy
rangeIncludes: MerchantReturnPolicySeasonalOverride
source: https://github.com/schemaorg/schemaorg/issues/2880
comment: Seasonal override of a return policy.
isPartOf: pending.schema.org

branch
type: Property
supersededBy: arterialBranch
isPartOf: health-lifesci.schema.org
domainIncludes: Nerve
rangeIncludes: AnatomicalStructure
comment: The branches that delineate from the nerve bundle. Not to be confused with branchOf.

arterialBranch
type: Property
isPartOf: health-lifesci.schema.org
domainIncludes: Artery
comment: The branches that comprise the arterial structure.
rangeIncludes: AnatomicalStructure

playersOnline
type: Property
rangeIncludes: Integer
domainIncludes: GameServer
comment: Number of players on the server.

study
type: Property
rangeIncludes: MedicalStudy
isPartOf: health-lifesci.schema.org
comment: A medical study or trial related to this entity.
domainIncludes: MedicalEntity

lyricist
type: Property
comment: The person who wrote the words.
domainIncludes: MusicComposition
rangeIncludes: Person
contributor: MBZ

sender
type: Property
rangeIncludes: Organization
rangeIncludes: Audience
rangeIncludes: Person
domainIncludes: ReceiveAction
domainIncludes: Message
sub property of: participant
comment: A sub property of participant. The participant who is at the sending end of the action.

department
type: Property
rangeIncludes: Organization
domainIncludes: Organization
comment: A relationship between an organization and a department of that organization, also described as an organization (allowing different urls, logos, opening hours). For example: a store with a pharmacy, or a bakery with a cafe.

vehicleEngine
type: Property
comment: Information about the engine or engines of the vehicle.
contributor: Automotive Ontology Working Group
domainIncludes: Vehicle
rangeIncludes: EngineSpecification

AllergiesHealthAspect
type: HealthAspectEnumeration
comment: Content about the allergy-related aspects of a health topic.
source: https://github.com/schemaorg/schemaorg/issues/2799
isPartOf: pending.schema.org

transmissionMethod
type: Property
isPartOf: health-lifesci.schema.org
comment: How the disease spreads, either as a route or vector, for example 'direct contact', 'Aedes aegypti', etc.
rangeIncludes: Text
domainIncludes: InfectiousDisease

LivingWithHealthAspect
type: HealthAspectEnumeration
comment: Information about coping or life related to the topic.
isPartOf: pending.schema.org
source: https://github.com/schemaorg/schemaorg/issues/2374

eligibilityToWorkRequirement
type: Property
isPartOf: pending.schema.org
domainIncludes: JobPosting
source: https://github.com/schemaorg/schemaorg/issues/2384
rangeIncludes: Text
comment: The legal requirements such as citizenship, visa and other documentation required for an applicant to this job.

VeterinaryCare
type: Class
subclass of: MedicalOrganization
comment: A vet's office.
isPartOf: health-lifesci.schema.org

WorkersUnion
type: Class
source: https://github.com/schemaorg/schemaorg/issues/243
subclass of: Organization
comment: A Workers Union (also known as a Labor Union, Labour Union, or Trade Union) is an organization that promotes the interests of its worker members by collectively bargaining with management, organizing, and political lobbying.

hasCourse
type: Property
domainIncludes: EducationalOccupationalProgram
comment: A course or class that is one of the learning opportunities that constitute an educational / occupational program. No information is implied about whether the course is mandatory or optional; no guarantee is implied about whether the course will be available to everyone on the program.
isPartOf: pending.schema.org
source: https://github.com/schemaorg/schemaorg/issues/2483
rangeIncludes: Course

steps
type: Property
domainIncludes: HowToSection
domainIncludes: HowTo
comment: A single step item (as HowToStep, text, document, video, etc.) or a HowToSection (originally misnamed 'steps'; 'step' is preferred).
rangeIncludes: CreativeWork
rangeIncludes: ItemList
rangeIncludes: Text
supersededBy: step

Quiz
type: Class
source: https://github.com/schemaorg/schemaorg/issues/2611
comment: Quiz: A test of knowledge, skills and abilities.
subclass of: LearningResource
isPartOf: pending.schema.org

distribution
type: Property
domainIncludes: Dataset
comment: A downloadable form of this dataset, at a specific location, in a specific format. This property can be repeated if different variations are available. There is no expectation that different downloadable distributions must contain exactly equivalent information (see also [DCAT](https://www.w3.org/TR/vocab-dcat-3/#Class:Distribution) on this point). Different distributions might include or exclude different subsets of the entire dataset, for example.
rangeIncludes: DataDownload

legislationDateOfApplicability
type: Property
source: eli
source: https://github.com/schemaorg/schemaorg/issues/2698
equivalent property: date applicability
contributor: ELI
isPartOf: pending.schema.org
comment: The date at which the Legislation becomes applicable. This can sometimes be distinct from the date of entry into force : a text may come in force today, and state it will become applicable in 3 months.
domainIncludes: Legislation
rangeIncludes: Date

SubwayStation
type: Class
comment: A subway station.
subclass of: CivicStructure

leaseLength
type: Property
isPartOf: pending.schema.org
domainIncludes: Offer
domainIncludes: RealEstateListing
domainIncludes: Accommodation
rangeIncludes: Duration
rangeIncludes: QuantitativeValue
source: https://github.com/schemaorg/schemaorg/issues/2373
comment: Length of the lease for some Accommodation, either particular to some Offer or in some cases intrinsic to the property.

OfflineEventAttendanceMode
type: EventAttendanceModeEnumeration
isPartOf: pending.schema.org
comment: OfflineEventAttendanceMode - an event that is primarily conducted offline.
source: https://github.com/schemaorg/schemaorg/issues/1842

brand
type: Property
equivalent property: brandName
domainIncludes: Product
domainIncludes: Service
domainIncludes: Person
domainIncludes: Organization
comment: The brand(s) associated with a product or service, or the brand(s) maintained by an organization or business person.
sub property of: hasDesignation
rangeIncludes: Brand
rangeIncludes: Organization

weightTotal
type: Property
contributor: Automotive Ontology Working Group
domainIncludes: Vehicle
rangeIncludes: QuantitativeValue
isPartOf: auto.schema.org
comment: The permitted total weight of the loaded vehicle, including passengers and cargo and the weight of the empty vehicle.\n\nTypical unit code(s): KGM for kilogram, LBR for pound\n\n* Note 1: You can indicate additional information in the name of the QuantitativeValue node.\n* Note 2: You may also link to a QualitativeValue node that provides additional information using valueReference.\n* Note 3: Note that you can use minValue and maxValue to indicate ranges.

countryOfLastProcessing
type: Property
equivalent property: ProcessingCountry
comment: The place where the item (typically Product) was last processed and tested before importation.
domainIncludes: Product
rangeIncludes: Text
isPartOf: pending.schema.org
source: https://github.com/schemaorg/schemaorg/issues/991

foundingDate
type: Property
rangeIncludes: Date
domainIncludes: Organization
equivalent property: organizationFormationDate
comment: The date that this organization was founded.

duplicateTherapy
type: Property
domainIncludes: MedicalTherapy
isPartOf: health-lifesci.schema.org
rangeIncludes: MedicalTherapy
comment: A therapy that duplicates or overlaps this one.

nonprofitStatus
type: Property
rangeIncludes: NonprofitType
domainIncludes: Organization
source: https://github.com/schemaorg/schemaorg/issues/2543
comment: nonprofitStatus indicates the legal status of a non-profit organization in its primary place of business.
isPartOf: pending.schema.org

EndorsementRating
type: Class
subclass of: Rating
source: https://github.com/schemaorg/schemaorg/issues/1293
comment: An EndorsementRating is a rating that expresses some level of endorsement, for example inclusion in a "critic's pick" blog, a "Like" or "+1" on a social network. It can be considered the result of an EndorseAction in which the object of the action is rated positively by some agent. As is common elsewhere in schema.org, it is sometimes more useful to describe the results of such an action without explicitly describing the Action. An EndorsementRating may be part of a numeric scale or organized system, but this is not required: having an explicit type for indicating a positive, endorsement rating is particularly useful in the absence of numeric scales as it helps consumers understand that the rating is broadly positive.

recognizedBy
type: Property
rangeIncludes: Organization
comment: An organization that acknowledges the validity, value or utility of a credential. Note: recognition may include a process of quality assurance or accreditation.
domainIncludes: EducationalOccupationalCredential
source: https://github.com/schemaorg/schemaorg/issues/1779
isPartOf: pending.schema.org

videoQuality
type: Property
comment: The quality of the video.
domainIncludes: VideoObject
rangeIncludes: Text

loanType
type: Property
isPartOf: pending.schema.org
source: https://github.com/schemaorg/schemaorg/issues/1253
rangeIncludes: URL
rangeIncludes: Text
comment: The type of a loan or credit.
domainIncludes: LoanOrCredit
contributor: FIBO

workPresented
type: Property
comment: The movie presented during this event.
sub property of: workFeatured
domainIncludes: ScreeningEvent
rangeIncludes: Movie

workFeatured
type: Property
rangeIncludes: CreativeWork
comment: A work featured in some event, e.g. exhibited in an ExhibitionEvent. Specific subproperties are available for workPerformed (e.g. a play), or a workPresented (a Movie at a ScreeningEvent).
domainIncludes: Event

termsOfService
type: Property
comment: Human-readable terms of service documentation.
domainIncludes: Service
rangeIncludes: URL
rangeIncludes: Text
source: https://github.com/schemaorg/schemaorg/issues/1423
isPartOf: pending.schema.org

inChI
type: Property
comment: Non-proprietary identifier for molecular entity that can be used in printed and electronic data sources thus enabling easier linking of diverse data compilations.
domainIncludes: MolecularEntity
rangeIncludes: Text
isPartOf: pending.schema.org
source: MolecularEntity
sub property of: hasRepresentation

FulfillmentTypePickupInStore
type: FulfillmentTypeEnumeration
source: https://github.com/schemaorg/schemaorg/issues/3617
comment: Fulfillment through pick-up in a store.
isPartOf: pending.schema.org

ListenAction
type: Class
comment: The act of consuming audio content.
subclass of: ConsumeAction

doseSchedule
type: Property
comment: A dosing schedule for the drug for a given population, either observed, recommended, or maximum dose based on the type used.
domainIncludes: Drug
domainIncludes: TherapeuticProcedure
isPartOf: health-lifesci.schema.org
rangeIncludes: DoseSchedule

longitude
type: Property
comment: The longitude of a location. For example ```-122.08585``` ([WGS 84](https://en.wikipedia.org/wiki/World_Geodetic_System)).
sub property of: hasLongitude
domainIncludes: GeoCoordinates
domainIncludes: Place
rangeIncludes: Number
rangeIncludes: Text

endOffset
type: Property
domainIncludes: Clip
rangeIncludes: HyperTocEntry
rangeIncludes: Number
isPartOf: pending.schema.org
comment: The end time of the clip expressed as the number of seconds from the beginning of the work.
source: https://github.com/schemaorg/schemaorg/issues/2021

seatingType
type: Property
domainIncludes: Seat
rangeIncludes: Text
rangeIncludes: QualitativeValue
comment: The type/class of the seat.

pathophysiology
type: Property
domainIncludes: PhysicalActivity
domainIncludes: MedicalCondition
rangeIncludes: Text
comment: Changes in the normal mechanical, physical, and biochemical functions that are associated with this activity or condition.
isPartOf: health-lifesci.schema.org

byMonthDay
type: Property
rangeIncludes: Integer
isPartOf: pending.schema.org
source: https://github.com/schemaorg/schemaorg/issues/1457
comment: Defines the day(s) of the month on which a recurring Event takes place. Specified as an Integer between 1-31.
domainIncludes: Schedule

StoreCreditRefund
type: RefundTypeEnumeration
source: https://github.com/schemaorg/schemaorg/issues/2288
comment: Specifies that the customer receives a store credit as refund when returning a product.
isPartOf: pending.schema.org

priceComponentType
type: Property
isPartOf: pending.schema.org
source: https://github.com/schemaorg/schemaorg/issues/2689
comment: Identifies a price component (for example, a line item on an invoice), part of the total price for an offer.
rangeIncludes: PriceComponentTypeEnumeration
domainIncludes: UnitPriceSpecification

reservationStatus
type: Property
rangeIncludes: ReservationStatusType
domainIncludes: Reservation
comment: The current status of the reservation.

ResearchProject
type: Class
source: FundInfoCollab
source: https://github.com/schemaorg/schemaorg/issues/383
isPartOf: pending.schema.org
subclass of: Project
comment: A Research project.

EmailMessage
type: Class
subclass of: Message
comment: An email message.

relevantOccupation
type: Property
domainIncludes: JobPosting
source: https://github.com/schemaorg/schemaorg/issues/1698
comment: The Occupation for the JobPosting.
rangeIncludes: Occupation

isBasedOnUrl
type: Property
domainIncludes: CreativeWork
rangeIncludes: CreativeWork
rangeIncludes: URL
rangeIncludes: Product
comment: A resource that was used in the creation of this resource. This term can be repeated for multiple sources. For example, http://example.com/great-multiplication-intro.html.
supersededBy: isBasedOn

isBasedOn
type: Property
domainIncludes: CreativeWork
comment: A resource from which this work is derived or from which it is a modification or adaptation.
rangeIncludes: CreativeWork
rangeIncludes: URL
rangeIncludes: Product

Installment
type: PriceComponentTypeEnumeration
isPartOf: pending.schema.org
source: https://github.com/schemaorg/schemaorg/issues/2689
comment: Represents the installment pricing component of the total price for an offered product.

hasMenuSection
type: Property
domainIncludes: MenuSection
domainIncludes: Menu
comment: A subgrouping of the menu (by dishes, course, serving time period, etc.).
rangeIncludes: MenuSection

normalRange
type: Property
comment: Range of acceptable values for a typical patient, when applicable.
domainIncludes: MedicalTest
isPartOf: health-lifesci.schema.org
rangeIncludes: MedicalEnumeration
rangeIncludes: Text

domiciledMortgage
type: Property
domainIncludes: MortgageLoan
rangeIncludes: Boolean
source: https://github.com/schemaorg/schemaorg/issues/1253
contributor: FIBO
isPartOf: pending.schema.org
comment: Whether borrower is a resident of the jurisdiction where the property is located.

SchoolDistrict
type: Class
comment: A School District is an administrative area for the administration of schools.
subclass of: AdministrativeArea
source: https://github.com/schemaorg/schemaorg/issues/2500
isPartOf: pending.schema.org

meetsEmissionStandard
type: Property
comment: Indicates that the vehicle meets the respective emission standard.
rangeIncludes: Text
rangeIncludes: QualitativeValue
rangeIncludes: URL
isPartOf: auto.schema.org
contributor: Automotive Ontology Working Group
domainIncludes: Vehicle

broadcastFrequencyValue
type: Property
domainIncludes: BroadcastFrequencySpecification
source: https://github.com/schemaorg/schemaorg/issues/1004
rangeIncludes: QuantitativeValue
rangeIncludes: Number
comment: The frequency in MHz for a particular broadcast.

FDAcategoryB
type: DrugPregnancyCategory
comment: A designation by the US FDA signifying that animal reproduction studies have failed to demonstrate a risk to the fetus and there are no adequate and well-controlled studies in pregnant women.
isPartOf: health-lifesci.schema.org

gtin12
type: Property
domainIncludes: Product
domainIncludes: Demand
domainIncludes: Offer
rangeIncludes: Text
comment: The GTIN-12 code of the product, or the product to which the offer refers. The GTIN-12 is the 12-digit GS1 Identification Key composed of a U.P.C. Company Prefix, Item Reference, and Check Digit used to identify trade items. See [GS1 GTIN Summary](http://www.gs1.org/barcodes/technical/idkeys/gtin) for more details.
sub property of: gtin
sub property of: identifier

ElementarySchool
type: Class
subclass of: EducationalOrganization
comment: An elementary school.

thumbnail
type: Property
comment: Thumbnail image for an image or video.
domainIncludes: CreativeWork
rangeIncludes: ImageObject

paymentMethodId
type: Property
comment: An identifier for the method of payment used (e.g. the last 4 digits of the credit card).
rangeIncludes: Text
domainIncludes: Invoice
domainIncludes: Order
equivalent property: PaymentMeansID

ItemListOrderDescending
type: ItemListOrderType
comment: An ItemList ordered with higher values listed first.

observationDate
type: Property
domainIncludes: Observation
rangeIncludes: Date
rangeIncludes: DateTime
source: https://github.com/schemaorg/schemaorg/issues/2291
isPartOf: pending.schema.org
comment: The observationDate of an Observation.

itemDefectReturnShippingFeesAmount
type: Property
domainIncludes: MerchantReturnPolicy
comment: Amount of shipping costs for defect product returns. Applicable when property itemDefectReturnFees equals ReturnShippingFees.
rangeIncludes: MonetaryAmount
isPartOf: pending.schema.org
source: https://github.com/schemaorg/schemaorg/issues/2880

printColumn
type: Property
domainIncludes: NewsArticle
rangeIncludes: Text
comment: The number of the column in which the NewsArticle appears in the print edition.

acrissCode
type: Property
domainIncludes: Car
domainIncludes: BusOrCoach
isPartOf: auto.schema.org
rangeIncludes: Text
comment: The ACRISS Car Classification Code is a code used by many car rental companies, for classifying vehicles. ACRISS stands for Association of Car Rental Industry Systems and Standards.
contributor: Automotive Ontology Working Group

SaleEvent
type: Class
comment: Event type: Sales event.
subclass of: Event

educationRequirements
type: Property
rangeIncludes: Text
rangeIncludes: EducationalOccupationalCredential
comment: Educational background needed for the position or Occupation.
domainIncludes: Occupation
domainIncludes: JobPosting
isPartOf: pending.schema.org
source: https://github.com/schemaorg/schemaorg/issues/1779
source: https://github.com/schemaorg/schemaorg/issues/1698

actionPlatform
type: Property
rangeIncludes: DigitalPlatformEnumeration
rangeIncludes: URL
rangeIncludes: Text
comment: The high level platform(s) where the Action can be performed for the given URL. To specify a specific application or operating system instance, use actionApplication.
domainIncludes: EntryPoint

numItems
type: Property
source: https://github.com/schemaorg/schemaorg/issues/3617
rangeIncludes: QuantitativeValue
domainIncludes: ShippingConditions
isPartOf: pending.schema.org
comment: Limits the number of items being shipped for which these conditions apply.

exerciseType
type: Property
rangeIncludes: Text
domainIncludes: ExerciseAction
domainIncludes: ExercisePlan
isPartOf: health-lifesci.schema.org
comment: Type(s) of exercise or activity, such as strength training, flexibility training, aerobics, cardiac rehabilitation, etc.

partOfInvoice
type: Property
sub property of: isReferencedIn
sub property of: isPartOf
domainIncludes: Order
rangeIncludes: Invoice
comment: The order is being paid as part of the referenced Invoice.

beforeMedia
type: Property
domainIncludes: HowToDirection
rangeIncludes: MediaObject
rangeIncludes: URL
comment: A media object representing the circumstances before performing this direction.

DangerousGoodConsideration
type: AdultOrientedEnumeration
source: https://github.com/schemaorg/schemaorg/issues/2989
isPartOf: pending.schema.org
comment: The item is dangerous and requires careful handling and/or special training of the user. See also the [UN Model Classification](https://unece.org/DAM/trans/danger/publi/unrec/rev17/English/02EREv17_Part2.pdf) defining the 9 classes of dangerous goods such as explosives, gases, flammables, and more.

IgnoreAction
type: Class
comment: The act of intentionally disregarding the object. An agent ignores an object.
subclass of: AssessAction

appliesToDeliveryMethod
type: Property
domainIncludes: DeliveryChargeSpecification
domainIncludes: PaymentChargeSpecification
contributor: GoodRelationsTerms
rangeIncludes: DeliveryMethod
comment: The delivery method(s) to which the delivery charge or payment charge specification applies.

courseMode
type: Property
rangeIncludes: Text
rangeIncludes: URL
comment: The medium or means of delivery of the course instance or the mode of study, either as a text label (e.g. "online", "onsite" or "blended"; "synchronous" or "asynchronous"; "full-time" or "part-time") or as a URL reference to a term from a controlled vocabulary (e.g. https://ceds.ed.gov/element/001311#Asynchronous).
domainIncludes: CourseInstance

isGift
type: Property
domainIncludes: Order
rangeIncludes: Boolean
comment: Indicates whether the offer was accepted as a gift for someone other than the buyer.

diseasePreventionInfo
type: Property
domainIncludes: SpecialAnnouncement
rangeIncludes: URL
rangeIncludes: WebContent
source: https://github.com/schemaorg/schemaorg/issues/2490
isPartOf: pending.schema.org
comment: Information about disease prevention.

bodyLocation
type: Property
domainIncludes: MedicalProcedure
domainIncludes: AnatomicalStructure
rangeIncludes: Text
isPartOf: health-lifesci.schema.org
comment: Location in the body of the anatomical structure.

quarantineGuidelines
type: Property
source: https://github.com/schemaorg/schemaorg/issues/2490
isPartOf: pending.schema.org
comment: Guidelines about quarantine rules, e.g. in the context of a pandemic.
domainIncludes: SpecialAnnouncement
rangeIncludes: URL
rangeIncludes: WebContent

eventAttendanceMode
type: Property
rangeIncludes: EventAttendanceModeEnumeration
domainIncludes: Event
isPartOf: pending.schema.org
comment: The eventAttendanceMode of an event indicates whether it occurs online, offline, or a mix.
source: https://github.com/schemaorg/schemaorg/issues/1842

hasMenuItem
type: Property
comment: A food or drink item contained in a menu or menu section.
rangeIncludes: MenuItem
domainIncludes: MenuSection
domainIncludes: Menu

TierBenefitLoyaltyPoints
type: TierBenefitEnumeration
isPartOf: pending.schema.org
comment: Benefit of the tier is earning of loyalty points.
source: https://github.com/schemaorg/schemaorg/issues/3563

MulticellularParasite
type: InfectiousAgentClass
comment: Multicellular parasite that causes an infection.
isPartOf: health-lifesci.schema.org

StrikethroughPrice
type: PriceTypeEnumeration
source: https://github.com/schemaorg/schemaorg/issues/3583
isPartOf: pending.schema.org
comment: Represents the strikethrough price (the previous advertised price) of an offered product.

MerchantReturnNotPermitted
type: MerchantReturnEnumeration
source: https://github.com/schemaorg/schemaorg/issues/2288
comment: Specifies that product returns are not permitted.
isPartOf: pending.schema.org

competencyRequired
type: Property
isPartOf: pending.schema.org
rangeIncludes: DefinedTerm
rangeIncludes: URL
rangeIncludes: Text
domainIncludes: LearningResource
domainIncludes: EducationalOccupationalCredential
comment: Knowledge, skill, ability or personal attribute that must be demonstrated by a person or other entity in order to do something such as earn an Educational Occupational Credential or understand a LearningResource.
source: https://github.com/schemaorg/schemaorg/issues/1779

softwareAddOn
type: Property
domainIncludes: SoftwareApplication
rangeIncludes: SoftwareApplication
comment: Additional content for a software application.

cvdNumC19HospPats
type: Property
source: https://github.com/schemaorg/schemaorg/issues/2521
rangeIncludes: Number
comment: numc19hosppats - HOSPITALIZED: Patients currently hospitalized in an inpatient care location who have suspected or confirmed COVID-19.
isPartOf: pending.schema.org
domainIncludes: CDCPMDRecord

BusReservation
type: Class
comment: A reservation for bus travel. \n\nNote: This type is for information about actual reservations, e.g. in confirmation emails or HTML pages with individual confirmations of reservations. For offers of tickets, use Offer.
subclass of: Reservation

RelatedTopicsHealthAspect
type: HealthAspectEnumeration
source: https://github.com/schemaorg/schemaorg/issues/2374
comment: Other prominent or relevant topics tied to the main topic.
isPartOf: pending.schema.org

authenticator
type: Property
rangeIncludes: Organization
comment: The Organization responsible for authenticating the user's subscription. For example, many media apps require a cable/satellite provider to authenticate your subscription before playing media.
source: https://github.com/schemaorg/schemaorg/issues/1741
domainIncludes: MediaSubscription

firstAppearance
type: Property
comment: Indicates the first known occurrence of a Claim in some CreativeWork.
sub property of: workExample
domainIncludes: Claim
isPartOf: pending.schema.org
rangeIncludes: CreativeWork
source: https://github.com/schemaorg/schemaorg/issues/1828

workExample
type: Property
contributor: bibex
comment: Example/instance/realization/derivation of the concept of this creative work. E.g. the paperback edition, first edition, or e-book.
inverseOf: exampleOfWork
domainIncludes: CreativeWork
rangeIncludes: CreativeWork

UserPlusOnes
type: Class
supersededBy: InteractionCounter
subclass of: UserInteraction
comment: UserInteraction and its subtypes is an old way of talking about users interacting with pages. It is generally better to use Action-based vocabulary, alongside types such as Comment.

backstory
type: Property
comment: For an Article, typically a NewsArticle, the backstory property provides a textual summary giving a brief explanation of why and how an article was created. In a journalistic setting this could include information about reporting process, methods, interviews, data sources, etc.
rangeIncludes: Text
rangeIncludes: CreativeWork
contributor: TP
isPartOf: pending.schema.org
domainIncludes: Article
source: https://github.com/schemaorg/schemaorg/issues/1688

numberOfBedrooms
type: Property
isPartOf: pending.schema.org
domainIncludes: ApartmentComplex
domainIncludes: Accommodation
domainIncludes: FloorPlan
rangeIncludes: QuantitativeValue
rangeIncludes: Number
source: https://github.com/schemaorg/schemaorg/issues/2373
comment: The total integer number of bedrooms in a some Accommodation, ApartmentComplex or FloorPlan.

EmployerReview
type: Class
source: https://github.com/schemaorg/schemaorg/issues/1589
comment: An EmployerReview is a review of an Organization regarding its role as an employer, written by a current or former employee of that organization.
isPartOf: pending.schema.org
subclass of: Review

keywords
type: Property
domainIncludes: Product
domainIncludes: Event
domainIncludes: Place
domainIncludes: CreativeWork
domainIncludes: Organization
comment: Keywords or tags used to describe some item. Multiple textual entries in a keywords list are typically delimited by commas, or by repeating the property.
rangeIncludes: Text
rangeIncludes: DefinedTerm
rangeIncludes: URL

status
type: Property
domainIncludes: MedicalProcedure
domainIncludes: MedicalCondition
domainIncludes: MedicalStudy
isPartOf: health-lifesci.schema.org
rangeIncludes: EventStatusType
rangeIncludes: Text
rangeIncludes: MedicalStudyStatus
comment: The status of the study (enumerated).

purchaseDate
type: Property
comment: The date the item, e.g. vehicle, was purchased by the current owner.
contributor: Automotive Ontology Working Group
domainIncludes: Vehicle
domainIncludes: Product
rangeIncludes: Date

refundType
type: Property
comment: A refund type, from an enumerated list.
domainIncludes: MerchantReturnPolicySeasonalOverride
domainIncludes: MerchantReturnPolicy
rangeIncludes: RefundTypeEnumeration
isPartOf: pending.schema.org
source: https://github.com/schemaorg/schemaorg/issues/2288

discusses
type: Property
rangeIncludes: CreativeWork
comment: Specifies the CreativeWork associated with the UserComment.
domainIncludes: UserComments

hasMolecularFunction
type: Property
domainIncludes: BioChemEntity
isPartOf: pending.schema.org
rangeIncludes: DefinedTerm
rangeIncludes: URL
rangeIncludes: PropertyValue
source: BioChemEntity
comment: Molecular function performed by this BioChemEntity; please use PropertyValue if you want to include any evidence.

eligibleRegion
type: Property
domainIncludes: DeliveryChargeSpecification
domainIncludes: Offer
domainIncludes: Demand
domainIncludes: ActionAccessSpecification
contributor: GoodRelationsTerms
sub property of: areaServed
rangeIncludes: GeoShape
rangeIncludes: Text
rangeIncludes: Place
source: https://github.com/schemaorg/schemaorg/issues/1741
comment: The ISO 3166-1 (ISO 3166-1 alpha-2) or ISO 3166-2 code, the place, or the GeoShape for the geo-political region(s) for which the offer or delivery charge specification is valid.\n\nSee also ineligibleRegion.

areaServed
type: Property
domainIncludes: ContactPoint
domainIncludes: Offer
domainIncludes: Organization
domainIncludes: DeliveryChargeSpecification
domainIncludes: FinancialIncentive
domainIncludes: Demand
domainIncludes: Service
rangeIncludes: Place
rangeIncludes: AdministrativeArea
rangeIncludes: GeoShape
rangeIncludes: Text
comment: The geographic area where a service or offered item is provided.
equivalent property: hasServiceArea

yearBuilt
type: Property
isPartOf: pending.schema.org
comment: The year an Accommodation was constructed. This corresponds to the [YearBuilt field in RESO](https://ddwiki.reso.org/display/DDW17/YearBuilt+Field).
domainIncludes: Accommodation
source: https://github.com/schemaorg/schemaorg/issues/2373
rangeIncludes: Number

vehicleSpecialUsage
type: Property
isPartOf: auto.schema.org
rangeIncludes: Text
rangeIncludes: CarUsageType
comment: Indicates whether the vehicle has been used for special purposes, like commercial rental, driving school, or as a taxi. The legislation in many countries requires this information to be revealed when offering a car for sale.
contributor: Automotive Ontology Working Group
domainIncludes: Vehicle

baseSalary
type: Property
rangeIncludes: MonetaryAmount
rangeIncludes: PriceSpecification
rangeIncludes: Number
domainIncludes: EmployeeRole
domainIncludes: JobPosting
comment: The base salary of the job or of an employee in an EmployeeRole.

suggestedMeasurement
type: Property
domainIncludes: SizeSpecification
domainIncludes: PeopleAudience
rangeIncludes: QuantitativeValue
source: https://github.com/schemaorg/schemaorg/issues/2811
comment: A suggested range of body measurements for the intended audience or person, for example inseam between 32 and 34 inches or height between 170 and 190 cm. Typically found on a size chart for wearable products.
isPartOf: pending.schema.org

OrderCancelled
type: OrderStatus
comment: OrderStatus representing cancellation of an order.

httpMethod
type: Property
rangeIncludes: Text
domainIncludes: EntryPoint
comment: An HTTP method that specifies the appropriate HTTP method for a request to an HTTP EntryPoint. Values are capitalized strings as used in HTTP.

LiteraryEvent
type: Class
comment: Event type: Literary event.
subclass of: Event

tracks
type: Property
comment: A music recording (track)—usually a single song.
supersededBy: track
rangeIncludes: MusicRecording
domainIncludes: MusicPlaylist
domainIncludes: MusicGroup

track
type: Property
domainIncludes: MusicGroup
domainIncludes: MusicPlaylist
rangeIncludes: ItemList
rangeIncludes: MusicRecording
comment: A music recording (track)—usually a single song. If an ItemList is given, the list should contain items of type MusicRecording.
contributor: MBZ

exceptDate
type: Property
domainIncludes: Schedule
rangeIncludes: Date
rangeIncludes: DateTime
source: https://github.com/schemaorg/schemaorg/issues/1457
comment: Defines a Date or DateTime during which a scheduled Event will not take place. The property allows exceptions to a Schedule to be specified. If an exception is specified as a DateTime then only the event that would have started at that specific date and time should be excluded from the schedule. If an exception is specified as a Date then any event that is scheduled for that 24 hour period should be excluded from the schedule. This allows a whole day to be excluded from the schedule without having to itemise every scheduled event.
isPartOf: pending.schema.org

signOrSymptom
type: Property
rangeIncludes: MedicalSignOrSymptom
domainIncludes: MedicalCondition
isPartOf: health-lifesci.schema.org
comment: A sign or symptom of this condition. Signs are objective or physically observable manifestations of the medical condition while symptoms are the subjective experience of the medical condition.

noBylinesPolicy
type: Property
rangeIncludes: CreativeWork
rangeIncludes: URL
source: https://github.com/schemaorg/schemaorg/issues/1688
domainIncludes: NewsMediaOrganization
sub property of: publishingPrinciples
comment: For a NewsMediaOrganization or other news-related Organization, a statement explaining when authors of articles are not named in bylines.
contributor: TP
isPartOf: pending.schema.org

hasDeliveryMethod
type: Property
domainIncludes: DeliveryEvent
domainIncludes: ParcelDelivery
rangeIncludes: DeliveryMethod
comment: Method used for delivery or shipping.

KeepProduct
type: ReturnMethodEnumeration
source: https://github.com/schemaorg/schemaorg/issues/2880
comment: Specifies that the consumer can keep the product, even when receiving a refund or store credit.
isPartOf: pending.schema.org

financialAidEligible
type: Property
rangeIncludes: DefinedTerm
rangeIncludes: Text
domainIncludes: EducationalOccupationalProgram
domainIncludes: Course
comment: A financial aid type or program which students may use to pay for tuition or fees associated with the program.
source: https://github.com/schemaorg/schemaorg/issues/2418
isPartOf: pending.schema.org

honorificPrefix
type: Property
rangeIncludes: Text
domainIncludes: Person
comment: An honorific prefix preceding a Person's name such as Dr/Mrs/Mr.

minimumPaymentDue
type: Property
rangeIncludes: PriceSpecification
rangeIncludes: MonetaryAmount
sub property of: hasMonetaryAmount
sub property of: hasLowerBound
domainIncludes: Invoice
comment: The minimum payment required at this time.

AlcoholConsideration
type: AdultOrientedEnumeration
source: https://github.com/schemaorg/schemaorg/issues/2989
comment: Item contains alcohol or promotes alcohol consumption.
isPartOf: pending.schema.org

minPrice
type: Property
contributor: GoodRelationsTerms
sub property of: hasMonetaryAmount
sub property of: hasLowerBound
rangeIncludes: Number
comment: The lowest price if the price is a range.
domainIncludes: PriceSpecification

editor
type: Property
comment: Specifies the Person who edited the CreativeWork.
domainIncludes: CreativeWork
rangeIncludes: Person

cssSelector
type: Property
source: https://github.com/schemaorg/schemaorg/issues/1389
comment: A CSS selector, e.g. of a SpeakableSpecification or WebPageElement. In the latter case, multiple matches within a page can constitute a single conceptual "Web page element".
domainIncludes: SpeakableSpecification
domainIncludes: WebPageElement
rangeIncludes: CssSelectorType

aircraft
type: Property
domainIncludes: Flight
rangeIncludes: Vehicle
rangeIncludes: Text
comment: The kind of aircraft (e.g., "Boeing 747").

nsn
type: Property
sub property of: identifier
sub property of: identifiedBy
source: https://github.com/schemaorg/schemaorg/issues/2126
comment: Indicates the [NATO stock number](https://en.wikipedia.org/wiki/NATO_Stock_Number) (nsn) of a Product.
rangeIncludes: Text
domainIncludes: Product
equivalent property: nSNId
isPartOf: pending.schema.org

includedInHealthInsurancePlan
type: Property
isPartOf: pending.schema.org
source: https://github.com/schemaorg/schemaorg/issues/1062
comment: The insurance plans that cover this drug.
rangeIncludes: HealthInsurancePlan
domainIncludes: Drug

unitCode
type: Property
rangeIncludes: URL
rangeIncludes: Text
domainIncludes: PropertyValue
domainIncludes: TypeAndQuantityNode
domainIncludes: QuantitativeValue
domainIncludes: UnitPriceSpecification
contributor: GoodRelationsTerms
comment: The unit of measurement given using the UN/CEFACT Common Code (3 characters) or a URL. Other codes than the UN/CEFACT Common Code may be used with a prefix followed by a colon.

courseCode
type: Property
comment: The identifier for the Course used by the course provider (e.g. CS101 or 6.001).
rangeIncludes: Text
domainIncludes: Course

DepositAccount
type: Class
contributor: FIBO
subclass of: BankAccount
subclass of: InvestmentOrDeposit
comment: A type of Bank Account with a main purpose of depositing funds to gain interest or other benefits.

legislationCorrects
type: Property
equivalent property: corrects
domainIncludes: Legislation
contributor: ELI
source: eli
source: https://github.com/schemaorg/schemaorg/issues/2698
rangeIncludes: Legislation
isPartOf: pending.schema.org
comment: Another legislation in which this one introduces textual changes, like correction of spelling mistakes, with no legal impact (for modifications that have legal impact, use legislationAmends).

Podiatric
type: MedicalSpecialty
comment: Podiatry is the care of the human foot, especially the diagnosis and treatment of foot disorders.
isPartOf: health-lifesci.schema.org
subclass of: MedicalBusiness

Plumber
type: Class
comment: A plumbing service.
subclass of: HomeAndConstructionBusiness

legislationTransposes
type: Property
domainIncludes: Legislation
contributor: ELI
rangeIncludes: Legislation
source: eli
source: https://github.com/schemaorg/schemaorg/issues/1156
isPartOf: pending.schema.org
equivalent property: transposes
comment: Indicates that this legislation (or part of legislation) fulfills the objectives set by another legislation, by passing appropriate implementation measures. Typically, some legislations of European Union's member states or regions transpose European Directives. This indicates a legally binding link between the 2 legislations.
sub property of: legislationApplies

legislationApplies
type: Property
source: https://github.com/schemaorg/schemaorg/issues/1156
source: eli
domainIncludes: Legislation
contributor: ELI
comment: Indicates that this legislation (or part of a legislation) somehow transfers another legislation in a different legislative context. This is an informative link, and it has no legal value. For legally-binding links of transposition, use the legislationTransposes property. For example an informative consolidated law of a European Union's member state "applies" the consolidated version of the European Directive implemented in it.
rangeIncludes: Legislation
equivalent property: implements
isPartOf: pending.schema.org

surface
type: Property
domainIncludes: VisualArtwork
rangeIncludes: Text
rangeIncludes: URL
supersededBy: artworkSurface
sub property of: material
comment: A material used as a surface in some artwork, e.g. Canvas, Paper, Wood, Board, etc.

artworkSurface
type: Property
rangeIncludes: Text
rangeIncludes: URL
comment: The supporting materials for the artwork, e.g. Canvas, Paper, Wood, Board, etc.
domainIncludes: VisualArtwork

departureTerminal
type: Property
rangeIncludes: Text
comment: Identifier of the flight's departure terminal.
domainIncludes: Flight

suggestedMinAge
type: Property
rangeIncludes: Number
comment: Minimum recommended age in years for the audience or user.
domainIncludes: PeopleAudience

Oncologic
type: MedicalSpecialty
comment: A specific branch of medical science that deals with benign and malignant tumors, including the study of their development, diagnosis, treatment and prevention.
isPartOf: health-lifesci.schema.org
subclass of: MedicalBusiness

runsTo
type: Property
rangeIncludes: Vessel
isPartOf: health-lifesci.schema.org
comment: The vasculature the lymphatic structure runs, or efferents, to.
domainIncludes: LymphaticVessel

webCheckinTime
type: Property
domainIncludes: Flight
comment: The time when a passenger can check into the flight online.
rangeIncludes: DateTime

siblings
type: Property
domainIncludes: Person
rangeIncludes: Person
supersededBy: sibling
comment: A sibling of the person.

sibling
type: Property
domainIncludes: Person
rangeIncludes: Person
comment: A sibling of the person.

BroadcastRelease
type: MusicAlbumReleaseType
contributor: MBZ
comment: BroadcastRelease.

LikeAction
type: Class
comment: The act of expressing a positive sentiment about the object. An agent likes an object (a proposition, topic or theme) with participants.
subclass of: ReactAction

leiCode
type: Property
comment: An organization identifier that uniquely identifies a legal entity as defined in ISO 17442.
equivalent property: hasLegalEntityIdentifier
equivalent property: hasLEI
contributor: FIBO
contributor: GLEIF
rangeIncludes: Text
sub property of: identifier
domainIncludes: Organization

touristType
type: Property
rangeIncludes: Text
rangeIncludes: Audience
contributor: Tourism
contributor: IIT-CNR.it
comment: Attraction suitable for type(s) of tourist. E.g. children, visitors from a particular country, etc.
domainIncludes: TouristDestination
domainIncludes: TouristTrip
domainIncludes: TouristAttraction

PharmacySpecialty
type: MedicalSpecialty
isPartOf: health-lifesci.schema.org
comment: The practice or art and science of preparing and dispensing drugs and medicines.

negativeNotes
type: Property
isPartOf: pending.schema.org
comment: Provides negative considerations regarding something, most typically in pro/con lists for reviews (alongside positiveNotes). For symmetry In the case of a Review, the property describes the itemReviewed from the perspective of the review; in the case of a Product, the product itself is being described. Since product descriptions tend to emphasise positive claims, it may be relatively unusual to find negativeNotes used in this way. Nevertheless for the sake of symmetry, negativeNotes can be used on Product. The property values can be expressed either as unstructured text (repeated as necessary), or if ordered, as a list (in which case the most negative is at the beginning of the list).
rangeIncludes: ItemList
rangeIncludes: ListItem
rangeIncludes: Text
rangeIncludes: WebContent
domainIncludes: Product
domainIncludes: Review
source: https://github.com/schemaorg/schemaorg/issues/2832

SatireOrParodyContent
type: MediaManipulationRatingEnumeration
isPartOf: pending.schema.org
source: https://github.com/schemaorg/schemaorg/issues/2450
comment: Content coded 'satire or parody content' in a MediaReview, considered in the context of how it was published or shared. For a VideoObject to be 'satire or parody content': A video that was created as political or humorous commentary and is presented in that context. (Reshares of satire/parody content that do not include relevant context are more likely to fall under the “missing context” rating.) For an ImageObject to be 'satire or parody content': An image that was created as political or humorous commentary and is presented in that context. (Reshares of satire/parody content that do not include relevant context are more likely to fall under the “missing context” rating.) For an ImageObject with embedded text to be 'satire or parody content': An image that was created as political or humorous commentary and is presented in that context. (Reshares of satire/parody content that do not include relevant context are more likely to fall under the “missing context” rating.) For an AudioObject to be 'satire or parody content': Audio that was created as political or humorous commentary and is presented in that context. (Reshares of satire/parody content that do not include relevant context are more likely to fall under the “missing context” rating.)

procedureType
type: Property
isPartOf: health-lifesci.schema.org
rangeIncludes: MedicalProcedureType
comment: The type of procedure, for example Surgical, Noninvasive, or Percutaneous.
domainIncludes: MedicalProcedure

Hotel
type: Class
contributor: STI Accommodation Ontology
subclass of: LodgingBusiness
comment: A hotel is an establishment that provides lodging paid on a short-term basis (source: Wikipedia, the free encyclopedia, see http://en.wikipedia.org/wiki/Hotel). See also the dedicated document on the use of schema.org for marking up hotels and other forms of accommodations.

percentile10
type: Property
rangeIncludes: Number
comment: The 10th percentile value.
domainIncludes: QuantitativeValueDistribution
source: https://github.com/schemaorg/schemaorg/issues/1698

verificationFactCheckingPolicy
type: Property
rangeIncludes: URL
rangeIncludes: CreativeWork
source: https://github.com/schemaorg/schemaorg/issues/1525
comment: Disclosure about verification and fact-checking processes for a NewsMediaOrganization or other fact-checking Organization.
domainIncludes: NewsMediaOrganization
contributor: TP
sub property of: publishingPrinciples
isPartOf: pending.schema.org

foodWarning
type: Property
rangeIncludes: Text
isPartOf: health-lifesci.schema.org
comment: Any precaution, guidance, contraindication, etc. related to consumption of specific foods while taking this drug.
domainIncludes: Drug

MedicalRiskCalculator
type: Class
isPartOf: health-lifesci.schema.org
subclass of: MedicalRiskEstimator
comment: A complex mathematical calculation requiring an online calculator, used to assess prognosis. Note: use the url property of Thing to record any URLs for online calculators.

includesObject
type: Property
domainIncludes: Offer
domainIncludes: ProductCollection
domainIncludes: Demand
contributor: GoodRelationsTerms
rangeIncludes: TypeAndQuantityNode
comment: This links to a node or nodes indicating the exact quantity of the products included in an Offer or ProductCollection.

device
type: Property
rangeIncludes: Text
comment: Device required to run the application. Used in cases where a specific make/model is required to run the application.
domainIncludes: SoftwareApplication
supersededBy: availableOnDevice

availableOnDevice
type: Property
comment: Device required to run the application. Used in cases where a specific make/model is required to run the application.
domainIncludes: SoftwareApplication
rangeIncludes: Text

monthlyMinimumRepaymentAmount
type: Property
contributor: FIBO
isPartOf: pending.schema.org
comment: The minimum payment is the lowest amount of money that one is required to pay on a credit card statement each month.
domainIncludes: PaymentCard
rangeIncludes: Number
rangeIncludes: MonetaryAmount
source: https://github.com/schemaorg/schemaorg/issues/1253

broadcastTimezone
type: Property
comment: The timezone in [ISO 8601 format](http://en.wikipedia.org/wiki/ISO_8601) for which the service bases its broadcasts.
domainIncludes: BroadcastService
rangeIncludes: Text

Downpayment
type: PriceComponentTypeEnumeration
isPartOf: pending.schema.org
source: https://github.com/schemaorg/schemaorg/issues/2689
comment: Represents the downpayment (up-front payment) price component of the total price for an offered product that has additional installment payments.

LeftHandDriving
type: SteeringPositionValue
comment: The steering position is on the left side of the vehicle (viewed from the main direction of driving).
contributor: Automotive Ontology Working Group

servingSize
type: Property
domainIncludes: NutritionInformation
rangeIncludes: Text
comment: The serving size, in terms of the number of volume or mass.

legislationLegalValue
type: Property
equivalent property: legal value
source: eli
source: https://github.com/schemaorg/schemaorg/issues/1156
isPartOf: pending.schema.org
rangeIncludes: LegalValueLevel
domainIncludes: LegislationObject
comment: The legal value of this legislation file. The same legislation can be written in multiple files with different legal values. Typically a digitally signed PDF have a "stronger" legal value than the HTML file of the same act.
contributor: ELI

awards
type: Property
rangeIncludes: Text
domainIncludes: CreativeWork
domainIncludes: Person
domainIncludes: Organization
domainIncludes: Product
comment: Awards won by or for this item.
supersededBy: award

award
type: Property
domainIncludes: Service
domainIncludes: Person
domainIncludes: Organization
domainIncludes: Product
domainIncludes: CreativeWork
rangeIncludes: Text
comment: An award won by or for this item.

orderedItem
type: Property
rangeIncludes: Service
rangeIncludes: Product
rangeIncludes: OrderItem
sub property of: hasProduct
comment: The item ordered.
domainIncludes: OrderItem
domainIncludes: Order

musicCompositionForm
type: Property
comment: The type of composition (e.g. overture, sonata, symphony, etc.).
contributor: MBZ
rangeIncludes: Text
domainIncludes: MusicComposition

shippingOrigin
type: Property
sub property of: hasLocation
domainIncludes: OfferShippingDetails
domainIncludes: ShippingConditions
rangeIncludes: DefinedRegion
source: https://github.com/schemaorg/schemaorg/issues/3617
source: https://github.com/schemaorg/schemaorg/issues/3122
comment: Indicates the origin of a shipment, i.e. where it should be coming from.
equivalent property: DespatchLocation

drugClass
type: Property
isPartOf: health-lifesci.schema.org
comment: The class of drug this belongs to (e.g., statins).
rangeIncludes: DrugClass
domainIncludes: Drug

experienceRequirements
type: Property
comment: Description of skills and experience needed for the position or Occupation.
domainIncludes: JobPosting
domainIncludes: Occupation
rangeIncludes: Text
rangeIncludes: OccupationalExperienceRequirements
source: https://github.com/schemaorg/schemaorg/issues/1698

entertainmentBusiness
type: Property
sub property of: location
comment: A sub property of location. The entertainment business where the action occurred.
domainIncludes: PerformAction
rangeIncludes: EntertainmentBusiness

countriesNotSupported
type: Property
domainIncludes: SoftwareApplication
comment: Countries for which the application is not supported. You can also provide the two-letter ISO 3166-1 alpha-2 country code.
rangeIncludes: Text

DoubleBlindedTrial
type: MedicalTrialDesign
comment: A trial design in which neither the researcher nor the patient knows the details of the treatment the patient was randomly assigned to.
isPartOf: health-lifesci.schema.org

strengthUnit
type: Property
isPartOf: health-lifesci.schema.org
comment: The units of an active ingredient's strength, e.g. mg.
domainIncludes: DrugStrength
rangeIncludes: Text

suitableForDiet
type: Property
rangeIncludes: RestrictedDiet
domainIncludes: MenuItem
domainIncludes: Recipe
comment: Indicates a dietary restriction or guideline for which this recipe or menu item is suitable, e.g. diabetic, halal etc.

guideline
type: Property
isPartOf: health-lifesci.schema.org
comment: A medical guideline related to this entity.
rangeIncludes: MedicalGuideline
domainIncludes: MedicalEntity

departureStation
type: Property
domainIncludes: TrainTrip
comment: The station from which the train departs.
rangeIncludes: TrainStation

reviewBody
type: Property
rangeIncludes: Text
domainIncludes: Review
comment: The actual body of the review.

MotorcycleDealer
type: Class
comment: A motorcycle dealer.
subclass of: AutomotiveBusiness

albumProductionType
type: Property
rangeIncludes: MusicAlbumProductionType
comment: Classification of the album by its type of content: soundtrack, live album, studio album, etc.
contributor: MBZ
domainIncludes: MusicAlbum

ContactPage
type: Class
subclass of: WebPage
comment: Web page type: Contact page.

legislationEnsuresImplementationOf
type: Property
contributor: ELI
rangeIncludes: Legislation
isPartOf: pending.schema.org
equivalent property: ensures implementation of
source: eli
source: https://github.com/schemaorg/schemaorg/issues/2698
comment: Indicates that this Legislation ensures the implementation of another Legislation, for example by modifying national legislations so that they do not contradict to an EU regulation or decision. This implies a legal meaning. Transpositions of EU Directive should be captured with legislationTransposes.
sub property of: legislationApplies
domainIncludes: Legislation

menuAddOn
type: Property
rangeIncludes: MenuSection
rangeIncludes: MenuItem
domainIncludes: MenuItem
comment: Additional menu item(s) such as a side dish of salad or side order of fries that can be added to this menu item. Additionally it can be a menu section containing allowed add-on menu items for this menu item.
source: https://github.com/schemaorg/schemaorg/issues/1541

nextItem
type: Property
domainIncludes: ListItem
comment: A link to the ListItem that follows the current one.
rangeIncludes: ListItem

previousItem
type: Property
comment: A link to the ListItem that precedes the current one.
domainIncludes: ListItem
rangeIncludes: ListItem

orderItemStatus
type: Property
comment: The current status of the order item.
domainIncludes: OrderItem
rangeIncludes: OrderStatus

parentService
type: Property
rangeIncludes: BroadcastService
domainIncludes: BroadcastService
comment: A broadcast service to which the broadcast service may belong to such as regional variations of a national channel.

MotorizedBicycle
type: Class
contributor: Automotive Ontology Working Group
subclass of: Vehicle
comment: A motorized bicycle is a bicycle with an attached motor used to power the vehicle, or to assist with pedaling.
isPartOf: auto.schema.org

address
type: Property
rangeIncludes: PostalAddress
rangeIncludes: Text
domainIncludes: Place
domainIncludes: Person
domainIncludes: Organization
domainIncludes: GeoShape
domainIncludes: GeoCoordinates
comment: Physical address of the item.

Completed
type: MedicalStudyStatus
comment: Completed.
isPartOf: health-lifesci.schema.org

associatedMedia
type: Property
comment: A media object that encodes this CreativeWork. This property is a synonym for encoding.
domainIncludes: HyperToc
domainIncludes: HyperTocEntry
domainIncludes: CreativeWork
rangeIncludes: MediaObject

accessModeSufficient
type: Property
domainIncludes: CreativeWork
rangeIncludes: ItemList
source: https://github.com/schemaorg/schemaorg/issues/1100
comment: A list of single or combined accessModes that are sufficient to understand all the intellectual content of a resource. Values should be drawn from the [approved vocabulary](https://www.w3.org/2021/a11y-discov-vocab/latest/#accessModeSufficient-vocabulary).

increasesRiskOf
type: Property
domainIncludes: MedicalRiskFactor
isPartOf: health-lifesci.schema.org
comment: The condition, complication, etc. influenced by this factor.
rangeIncludes: MedicalEntity

acquireLicensePage
type: Property
isPartOf: pending.schema.org
domainIncludes: CreativeWork
sub property of: usageInfo
rangeIncludes: CreativeWork
rangeIncludes: URL
source: https://github.com/schemaorg/schemaorg/issues/2454
comment: Indicates a page documenting how licenses can be purchased or otherwise acquired, for the current item.

usageInfo
type: Property
comment: The schema.org usageInfo property indicates further information about a CreativeWork. This property is applicable both to works that are freely available and to those that require payment or other transactions. It can reference additional information, e.g. community expectations on preferred linking and citation conventions, as well as purchasing details. For something that can be commercially licensed, usageInfo can provide detailed, resource-specific information about licensing options. This property can be used alongside the license property which indicates license(s) applicable to some piece of content. The usageInfo property can provide information about other licensing options, e.g. acquiring commercial usage rights for an image that is also available under non-commercial creative commons licenses.
domainIncludes: CreativeWork
isPartOf: pending.schema.org
rangeIncludes: CreativeWork
rangeIncludes: URL
source: https://github.com/schemaorg/schemaorg/issues/2454

FundingAgency
type: Class
source: https://github.com/schemaorg/schemaorg/issues/383
source: FundInfoCollab
isPartOf: pending.schema.org
subclass of: Project
comment: A FundingAgency is an organization that implements one or more FundingSchemes and manages the granting process (via Grants, typically MonetaryGrants). A funding agency is not always required for grant funding, e.g. philanthropic giving, corporate sponsorship etc. Examples of funding agencies include ERC, REA, NIH, Bill and Melinda Gates Foundation, ...

cvdCollectionDate
type: Property
isPartOf: pending.schema.org
domainIncludes: CDCPMDRecord
rangeIncludes: DateTime
rangeIncludes: Text
comment: collectiondate - Date for which patient counts are reported.
source: https://github.com/schemaorg/schemaorg/issues/2521

illustrator
type: Property
domainIncludes: Book
comment: The illustrator of the book.
rangeIncludes: Person

knows
type: Property
comment: The most generic bi-directional social/work relation.
rangeIncludes: Person
domainIncludes: Person

hasMerchantReturnPolicy
type: Property
domainIncludes: Offer
domainIncludes: Organization
domainIncludes: Product
source: https://github.com/schemaorg/schemaorg/issues/2288
rangeIncludes: MerchantReturnPolicy
comment: Specifies a MerchantReturnPolicy that may be applicable.
isPartOf: pending.schema.org

menu
type: Property
rangeIncludes: Menu
rangeIncludes: URL
rangeIncludes: Text
supersededBy: hasMenu
comment: Either the actual menu as a structured representation, as text, or a URL of the menu.
domainIncludes: FoodEstablishment

hasMenu
type: Property
rangeIncludes: Text
rangeIncludes: Menu
rangeIncludes: URL
domainIncludes: FoodEstablishment
comment: Either the actual menu as a structured representation, as text, or a URL of the menu.

KosherDiet
type: RestrictedDiet
comment: A diet conforming to Jewish dietary practices.

screenCount
type: Property
domainIncludes: MovieTheater
rangeIncludes: Number
comment: The number of screens in the movie theater.

composer
type: Property
domainIncludes: MusicComposition
domainIncludes: Event
rangeIncludes: Person
rangeIncludes: Organization
comment: The person or organization who wrote a composition, or who is the composer of a work performed at some event.
contributor: MBZ

storageRequirements
type: Property
domainIncludes: SoftwareApplication
rangeIncludes: URL
rangeIncludes: Text
comment: Storage requirements (free space required).

IncentiveTypeTaxCredit
type: IncentiveType
isPartOf: pending.schema.org
source: https://github.com/schemaorg/schemaorg/issues/3572
comment: An incentive that directly reduces the amount of tax owed by the recipient.

availableDeliveryMethod
type: Property
domainIncludes: Offer
domainIncludes: Demand
contributor: GoodRelationsTerms
rangeIncludes: DeliveryMethod
comment: The delivery method(s) available for this offer.

torque
type: Property
contributor: Automotive Ontology Working Group
rangeIncludes: QuantitativeValue
domainIncludes: EngineSpecification
comment: The torque (turning force) of the vehicle's engine.\n\nTypical unit code(s): NU for newton metre (N m), F17 for pound-force per foot, or F48 for pound-force per inch\n\n* Note 1: You can link to information about how the given value has been determined (e.g. reference RPM) using the valueReference property.\n* Note 2: You can use minValue and maxValue to indicate ranges.
isPartOf: auto.schema.org

interactionService
type: Property
rangeIncludes: SoftwareApplication
rangeIncludes: WebSite
comment: The WebSite or SoftwareApplication where the interactions took place.
domainIncludes: InteractionCounter

readBy
type: Property
rangeIncludes: Person
sub property of: actor
domainIncludes: Audiobook
isPartOf: bib.schema.org
comment: A person who reads (performs) the audiobook.

actor
type: Property
rangeIncludes: PerformingGroup
rangeIncludes: Person
domainIncludes: VideoGameSeries
domainIncludes: Movie
domainIncludes: PodcastSeries
domainIncludes: Clip
domainIncludes: Episode
domainIncludes: Event
domainIncludes: CreativeWorkSeason
domainIncludes: VideoGame
domainIncludes: MovieSeries
domainIncludes: VideoObject
domainIncludes: TVSeries
domainIncludes: RadioSeries
comment: An actor (individual or a group), e.g. in TV, radio, movie, video games etc., or in an event. Actors can be associated with individual items or with a series, episode, clip.

orderItemNumber
type: Property
rangeIncludes: Text
domainIncludes: OrderItem
comment: The identifier of the order item.
equivalent property: LineItemIdentifier

CleaningFee
type: PriceComponentTypeEnumeration
comment: Represents the cleaning fee part of the total price for an offered product, for example a vacation rental.
isPartOf: pending.schema.org
source: https://github.com/schemaorg/schemaorg/issues/2689

estimatedFlightDuration
type: Property
domainIncludes: Flight
rangeIncludes: Text
rangeIncludes: Duration
comment: The estimated time the flight will take.

ReturnFeesCustomerResponsibility
type: ReturnFeesEnumeration
source: https://github.com/schemaorg/schemaorg/issues/2880
comment: Specifies that product returns must be paid for, and are the responsibility of, the customer.
isPartOf: pending.schema.org

insertion
type: Property
rangeIncludes: AnatomicalStructure
comment: The place of attachment of a muscle, or what the muscle moves.
domainIncludes: Muscle
isPartOf: health-lifesci.schema.org

UserTweets
type: Class
subclass of: UserInteraction
comment: UserInteraction and its subtypes is an old way of talking about users interacting with pages. It is generally better to use Action-based vocabulary, alongside types such as Comment.
supersededBy: InteractionCounter

exerciseRelatedDiet
type: Property
sub property of: instrument
domainIncludes: ExerciseAction
comment: A sub property of instrument. The diet used in this action.
isPartOf: health-lifesci.schema.org
rangeIncludes: Diet

numberOfSeasons
type: Property
domainIncludes: VideoGameSeries
domainIncludes: TVSeries
domainIncludes: RadioSeries
rangeIncludes: Integer
comment: The number of seasons in this series.

usedToDiagnose
type: Property
domainIncludes: MedicalTest
isPartOf: health-lifesci.schema.org
comment: A condition the test is used to diagnose.
rangeIncludes: MedicalCondition

deathDate
type: Property
comment: Date of death.
domainIncludes: Person
rangeIncludes: Date

purchaseType
type: Property
domainIncludes: FinancialIncentive
isPartOf: pending.schema.org
source: https://github.com/schemaorg/schemaorg/issues/3572
rangeIncludes: PurchaseType
comment: Optional. The type of purchase the consumer must make in order to qualify for this incentive.

restPeriods
type: Property
rangeIncludes: Text
rangeIncludes: QuantitativeValue
isPartOf: health-lifesci.schema.org
domainIncludes: ExercisePlan
comment: How often one should break from the activity.

InternationalTrial
type: MedicalTrialDesign
comment: An international trial.
isPartOf: health-lifesci.schema.org

Optician
type: Class
isPartOf: health-lifesci.schema.org
subclass of: MedicalBusiness
comment: A store that sells reading glasses and similar devices for improving vision.

PhysicalTherapy
type: Class
subclass of: MedicalTherapy
isPartOf: health-lifesci.schema.org
comment: A process of progressive physical care and rehabilitation aimed at improving a health condition.

StagedContent
type: MediaManipulationRatingEnumeration
source: https://github.com/schemaorg/schemaorg/issues/2450
isPartOf: pending.schema.org
comment: Content coded 'staged content' in a MediaReview, considered in the context of how it was published or shared. For a VideoObject to be 'staged content': A video that has been created using actors or similarly contrived. For an ImageObject to be 'staged content': An image that was created using actors or similarly contrived, such as a screenshot of a fake tweet. For an ImageObject with embedded text to be 'staged content': An image that was created using actors or similarly contrived, such as a screenshot of a fake tweet. For an AudioObject to be 'staged content': Audio that has been created using actors or similarly contrived.

Playground
type: Class
subclass of: CivicStructure
comment: A playground.

lifeEvent
type: Property
isPartOf: pending.schema.org
comment: A life event like baptism, communions, Bar Mitzvahs, Aqiqah, Namakarana, Miyamairi, burial, ....
source: https://github.com/schemaorg/schemaorg/issues/4540
rangeIncludes: Event
domainIncludes: Person

WearableMeasurementWaist
type: WearableMeasurementTypeEnumeration
source: https://github.com/schemaorg/schemaorg/issues/2811
isPartOf: pending.schema.org
comment: Measurement of the waist section, for example of pants.

parentItem
type: Property
comment: The parent of a question, answer or item in general. Typically used for Q/A discussion threads e.g. a chain of comments with the first comment being an Article or other CreativeWork. See also comment which points from something to a comment about it.
domainIncludes: Question
domainIncludes: Comment
domainIncludes: Answer
rangeIncludes: CreativeWork
rangeIncludes: Comment

postOp
type: Property
domainIncludes: MedicalDevice
isPartOf: health-lifesci.schema.org
comment: A description of the postoperative procedures, care, and/or followups for this device.
rangeIncludes: Text

DVDFormat
type: MusicReleaseFormatType
comment: DVDFormat.
contributor: MBZ

reviewRating
type: Property
rangeIncludes: Rating
domainIncludes: Review
comment: The rating given in this review. Note that reviews can themselves be rated. The ```reviewRating``` applies to rating given by the review. The aggregateRating property applies to the review itself, as a creative work.

trainingSalary
type: Property
comment: The estimated salary earned while in the program.
rangeIncludes: MonetaryAmountDistribution
domainIncludes: EducationalOccupationalProgram
domainIncludes: WorkBasedProgram
isPartOf: pending.schema.org
source: https://github.com/schemaorg/schemaorg/issues/2460
source: https://github.com/schemaorg/schemaorg/issues/2289

acceptedAnswer
type: Property
rangeIncludes: Answer
rangeIncludes: ItemList
domainIncludes: Question
comment: The answer(s) that has been accepted as best, typically on a Question/Answer site. Sites vary in their selection mechanisms, e.g. drawing on community opinion and/or the view of the Question author.
sub property of: suggestedAnswer

suggestedAnswer
type: Property
rangeIncludes: ItemList
rangeIncludes: Answer
comment: An answer (possibly one of several, possibly incorrect) to a Question, e.g. on a Question/Answer site.
domainIncludes: Question

specialOpeningHoursSpecification
type: Property
comment: The special opening hours of a certain place.\n\nUse this to explicitly override general opening hours brought in scope by openingHoursSpecification or openingHours.
rangeIncludes: OpeningHoursSpecification
domainIncludes: Place

propertyID
type: Property
rangeIncludes: Text
rangeIncludes: URL
comment: A commonly used identifier for the characteristic represented by the property, e.g. a manufacturer or a standard code for a property. propertyID can be (1) a prefixed string, mainly meant to be used with standards for product properties; (2) a site-specific, non-prefixed string (e.g. the primary key of the property or the vendor-specific ID of the property), or (3) a URL indicating the type of the property, either pointing to an external vocabulary, or a Web resource that describes the property (e.g. a glossary entry). Standards bodies should promote a standard prefix for the identifiers of properties from their standards.
domainIncludes: PropertyValue

interpretedAsClaim
type: Property
isPartOf: pending.schema.org
rangeIncludes: Claim
domainIncludes: CreativeWork
domainIncludes: MediaObject
comment: Used to indicate a specific claim contained, implied, translated or refined from the content of a MediaObject or other CreativeWork. The interpreting party can be indicated using claimInterpreter.
source: https://github.com/schemaorg/schemaorg/issues/2450
sub property of: description

hasMeasurement
type: Property
comment: A measurement of an item, For example, the inseam of pants, the wheel size of a bicycle, the gauge of a screw, or the carbon footprint measured for certification by an authority. Usually an exact measurement, but can also be a range of measurements for adjustable products, for example belts and ski bindings.
domainIncludes: SizeSpecification
domainIncludes: Offer
domainIncludes: Product
domainIncludes: Certification
rangeIncludes: QuantitativeValue
source: https://github.com/schemaorg/schemaorg/issues/2811
isPartOf: pending.schema.org

doesNotShip
type: Property
domainIncludes: ShippingRateSettings
domainIncludes: OfferShippingDetails
domainIncludes: ShippingConditions
source: https://github.com/schemaorg/schemaorg/issues/2506
source: https://github.com/schemaorg/schemaorg/issues/3617
comment: Indicates when shipping to a particular shippingDestination is not available.
rangeIncludes: Boolean

valueMinLength
type: Property
domainIncludes: PropertyValueSpecification
comment: Specifies the minimum allowed range for number of characters in a literal value.
rangeIncludes: Number

numberOfAvailableAccommodationUnits
type: Property
isPartOf: pending.schema.org
domainIncludes: ApartmentComplex
domainIncludes: FloorPlan
rangeIncludes: QuantitativeValue
source: https://github.com/schemaorg/schemaorg/issues/2373
comment: Indicates the number of available accommodation units in an ApartmentComplex, or the number of accommodation units for a specific FloorPlan (within its specific ApartmentComplex). See also numberOfAccommodationUnits.

softwareVersion
type: Property
domainIncludes: SoftwareApplication
comment: Version of the software instance.
rangeIncludes: Text

durationOfWarranty
type: Property
domainIncludes: WarrantyPromise
comment: The duration of the warranty promise. Common unitCode values are ANN for year, MON for months, or DAY for days.
sub property of: duration
rangeIncludes: QuantitativeValue
contributor: GoodRelationsTerms

duration
type: Property
domainIncludes: Schedule
domainIncludes: Movie
domainIncludes: Event
domainIncludes: QuantitativeValueDistribution
domainIncludes: MediaObject
domainIncludes: Episode
domainIncludes: ServicePeriod
domainIncludes: Audiobook
domainIncludes: MusicRelease
domainIncludes: MusicRecording
source: https://github.com/schemaorg/schemaorg/issues/1698
source: https://github.com/schemaorg/schemaorg/issues/1457
source: https://github.com/schemaorg/schemaorg/issues/3617
rangeIncludes: Duration
rangeIncludes: QuantitativeValue
comment: The duration of the item (movie, audio recording, event, etc.) in [ISO 8601 duration format](http://en.wikipedia.org/wiki/ISO_8601).

Bridge
type: Class
comment: A bridge.
subclass of: CivicStructure

requirements
type: Property
rangeIncludes: URL
rangeIncludes: Text
supersededBy: softwareRequirements
comment: Component dependency requirements for application. This includes runtime environments and shared libraries that are not included in the application distribution package, but required to run the application (examples: DirectX, Java or .NET runtime).
domainIncludes: SoftwareApplication

softwareRequirements
type: Property
rangeIncludes: URL
rangeIncludes: SoftwareApplication
rangeIncludes: Text
domainIncludes: SoftwareApplication
comment: Component dependency requirements for application. This includes runtime environments and shared libraries that are not included in the application distribution package, but required to run the application (examples: DirectX, Java or .NET runtime).

activeIngredient
type: Property
isPartOf: health-lifesci.schema.org
comment: An active ingredient, typically chemical compounds and/or biologic substances.
domainIncludes: Substance
domainIncludes: DietarySupplement
domainIncludes: DrugStrength
domainIncludes: Drug
rangeIncludes: Text

numberOfFullBathrooms
type: Property
domainIncludes: FloorPlan
domainIncludes: Accommodation
isPartOf: pending.schema.org
comment: Number of full bathrooms - The total number of full and ¾ bathrooms in an Accommodation. This corresponds to the [BathroomsFull field in RESO](https://ddwiki.reso.org/display/DDW17/BathroomsFull+Field).
rangeIncludes: Number
source: https://github.com/schemaorg/schemaorg/issues/2373

workPerformed
type: Property
rangeIncludes: CreativeWork
sub property of: workFeatured
domainIncludes: Event
comment: A work performed in some event, for example a play performed in a TheaterEvent.

PalliativeProcedure
type: Class
comment: A medical procedure intended primarily for palliative purposes, aimed at relieving the symptoms of an underlying health condition.
subclass of: MedicalTherapy
subclass of: MedicalProcedure
isPartOf: health-lifesci.schema.org

evidenceOrigin
type: Property
comment: Source of the data used to formulate the guidance, e.g. RCT, consensus opinion, etc.
isPartOf: health-lifesci.schema.org
domainIncludes: MedicalGuideline
rangeIncludes: Text

firstPerformance
type: Property
contributor: MBZ
comment: The date and place the work was first performed.
rangeIncludes: Event
domainIncludes: MusicComposition

SuspendAction
type: Class
subclass of: ControlAction
comment: The act of momentarily pausing a device or application (e.g. pause music playback or pause a timer).

scheduledPaymentDate
type: Property
domainIncludes: Invoice
comment: The date the invoice is scheduled to be paid.
rangeIncludes: Date

ElectronicsStore
type: Class
comment: An electronics store.
subclass of: Store

interactionCount
type: Property
supersededBy: interactionStatistic
comment: This property is deprecated, alongside the UserInteraction types on which it depended.

interactionStatistic
type: Property
comment: The number of interactions for the CreativeWork using the WebSite or SoftwareApplication. The most specific child type of InteractionCounter should be used.
domainIncludes: Person
domainIncludes: Organization
domainIncludes: CreativeWork
rangeIncludes: InteractionCounter
source: https://github.com/schemaorg/schemaorg/issues/2421

ScheduleAction
type: Class
subclass of: PlanAction
comment: Scheduling future actions, events, or tasks.\n\nRelated actions:\n\n* ReserveAction: Unlike ReserveAction, ScheduleAction allocates future actions (e.g. an event, a task, etc) towards a time slot / spatial allocation.

geoCovers
type: Property
comment: Represents a relationship between two geometries (or the places they represent), relating a covering geometry to a covered geometry. "Every point of b is a point of (the interior or boundary of) a". As defined in [DE-9IM](https://en.wikipedia.org/wiki/DE-9IM).
rangeIncludes: GeospatialGeometry
rangeIncludes: Place
domainIncludes: Place
domainIncludes: GeospatialGeometry

itemCondition
type: Property
domainIncludes: Product
domainIncludes: Demand
domainIncludes: Offer
domainIncludes: MerchantReturnPolicy
rangeIncludes: OfferItemCondition
comment: A predefined value from OfferItemCondition specifying the condition of the product or service, or the products or services included in the offer. Also used for product return policies to specify the condition of products accepted for returns.

characterAttribute
type: Property
rangeIncludes: Thing
domainIncludes: Game
domainIncludes: VideoGameSeries
comment: A piece of data that represents a particular aspect of a fictional character (skill, power, character points, advantage, disadvantage).

tributary
type: Property
rangeIncludes: AnatomicalStructure
domainIncludes: Vein
comment: The anatomical or organ system that the vein flows into; a larger structure that the vein connects to.
isPartOf: health-lifesci.schema.org

Clinician
type: MedicalAudienceType
comment: Medical clinicians, including practicing physicians and other medical professionals involved in clinical practice.
isPartOf: health-lifesci.schema.org

uploadDate
type: Property
rangeIncludes: DateTime
rangeIncludes: Date
comment: Date (including time if available) when this media object was uploaded to this site.
domainIncludes: MediaObject

serverStatus
type: Property
domainIncludes: GameServer
rangeIncludes: GameServerStatus
comment: Status of a game server.

WearableSizeSystemEurope
type: WearableSizeSystemEnumeration
isPartOf: pending.schema.org
comment: European size system for wearables.
source: https://github.com/schemaorg/schemaorg/issues/2811

EffectivenessHealthAspect
type: HealthAspectEnumeration
isPartOf: pending.schema.org
source: https://github.com/schemaorg/schemaorg/issues/2799
comment: Content about the effectiveness-related aspects of a health topic.

trackingUrl
type: Property
domainIncludes: ParcelDelivery
rangeIncludes: URL
comment: Tracking url for the parcel delivery.

Nonprofit501c6
type: USNonprofitType
source: https://github.com/schemaorg/schemaorg/issues/2543
comment: Nonprofit501c6: Non-profit type referring to Business Leagues, Chambers of Commerce, Real Estate Boards.
isPartOf: pending.schema.org

license
type: Property
comment: A license document that applies to this content, typically indicated by URL.
rangeIncludes: CreativeWork
rangeIncludes: URL
domainIncludes: CreativeWork

newsUpdatesAndGuidelines
type: Property
comment: Indicates a page with news updates and guidelines. This could often be (but is not required to be) the main page containing SpecialAnnouncement markup on a site.
domainIncludes: SpecialAnnouncement
rangeIncludes: URL
rangeIncludes: WebContent
isPartOf: pending.schema.org
source: https://github.com/schemaorg/schemaorg/issues/2490

cvdFacilityCounty
type: Property
isPartOf: pending.schema.org
domainIncludes: CDCPMDRecord
source: https://github.com/schemaorg/schemaorg/issues/2521
comment: Name of the County of the NHSN facility that this data record applies to. Use cvdFacilityId to identify the facility. To provide other details, healthcareReportingData can be used on a Hospital entry.
rangeIncludes: Text

breastfeedingWarning
type: Property
comment: Any precaution, guidance, contraindication, etc. related to this drug's use by breastfeeding mothers.
domainIncludes: Drug
rangeIncludes: Text
isPartOf: health-lifesci.schema.org

MinorHumanEditsDigitalSource
type: IPTCDigitalSourceEnumeration
source: https://github.com/schemaorg/schemaorg/issues/3392
comment: Content coded as 'minor human edits' using the IPTC digital source type vocabulary.
isPartOf: pending.schema.org

PhysiciansOffice
type: Class
subclass of: Physician
comment: A doctor's office or clinic.

acceptedPaymentMethod
type: Property
domainIncludes: Demand
domainIncludes: Offer
domainIncludes: Organization
rangeIncludes: Text
rangeIncludes: LoanOrCredit
rangeIncludes: PaymentMethod
source: https://github.com/schemaorg/schemaorg/issues/3537
contributor: GoodRelationsTerms
comment: The payment method(s) that are accepted in general by an organization, or for some specific demand or offer.

orderValue
type: Property
comment: Minimum and maximum order value for which these shipping conditions are valid.
domainIncludes: ShippingConditions
rangeIncludes: MonetaryAmount
isPartOf: pending.schema.org
source: https://github.com/schemaorg/schemaorg/issues/3617

MedicalSymptom
type: Class
isPartOf: health-lifesci.schema.org
subclass of: MedicalSignOrSymptom
comment: Any complaint sensed and expressed by the patient (therefore defined as subjective) like stomachache, lower-back pain, or fatigue.

Cash
type: PaymentMethodType
comment: Payment using cash, on premises, equivalent to http://purl.org/goodrelations/v1#Cash.

free
type: Property
rangeIncludes: Boolean
comment: A flag to signal that the item, event, or place is accessible for free.
supersededBy: isAccessibleForFree
domainIncludes: PublicationEvent

isAccessibleForFree
type: Property
comment: A flag to signal that the item, event, or place is accessible for free.
domainIncludes: Event
domainIncludes: Place
domainIncludes: CreativeWork
rangeIncludes: Boolean

itemDefectReturnFees
type: Property
rangeIncludes: ReturnFeesEnumeration
comment: The type of return fees for returns of defect products.
domainIncludes: MerchantReturnPolicy
isPartOf: pending.schema.org
source: https://github.com/schemaorg/schemaorg/issues/2880

Waterfall
type: Class
comment: A waterfall, like Niagara.
subclass of: BodyOfWater

Infectious
type: MedicalSpecialty
comment: Something in medical science that pertains to infectious diseases, i.e. caused by bacterial, viral, fungal or parasitic infections.
isPartOf: health-lifesci.schema.org

ratingCount
type: Property
comment: The count of total number of ratings.
rangeIncludes: Integer
domainIncludes: AggregateRating

language
type: Property
sub property of: instrument
domainIncludes: WriteAction
domainIncludes: CommunicateAction
comment: A sub property of instrument. The language used on this action.
supersededBy: inLanguage
rangeIncludes: Language

inLanguage
type: Property
domainIncludes: BroadcastService
domainIncludes: CommunicateAction
domainIncludes: LinkRole
domainIncludes: Event
domainIncludes: CreativeWork
domainIncludes: PronounceableText
domainIncludes: WriteAction
rangeIncludes: Language
rangeIncludes: Text
source: https://github.com/schemaorg/schemaorg/issues/2382
comment: The language of the content or performance or used in an action. Please use one of the language codes from the [IETF BCP 47 standard](http://tools.ietf.org/html/bcp47). See also availableLanguage.

ShareAction
type: Class
subclass of: CommunicateAction
comment: The act of distributing content to people for their amusement or edification.

transitTime
type: Property
domainIncludes: ShippingConditions
domainIncludes: ShippingDeliveryTime
comment: The typical delay the order has been sent for delivery and the goods reach the final customer. In the context of ShippingDeliveryTime, use the QuantitativeValue. Typical properties: minValue, maxValue, unitCode (d for DAY). In the context of ShippingConditions, use the ServicePeriod. It has a duration (as a QuantitativeValue) and also business days and a cut-off time.
rangeIncludes: ServicePeriod
rangeIncludes: QuantitativeValue
source: https://github.com/schemaorg/schemaorg/issues/2506
source: https://github.com/schemaorg/schemaorg/issues/3617

bed
type: Property
domainIncludes: HotelRoom
domainIncludes: Accommodation
domainIncludes: Suite
comment: The type of bed or beds included in the accommodation. For the single case of just one bed of a certain type, you use bed directly with a text. If you want to indicate the quantity of a certain kind of bed, use an instance of BedDetails. For more detailed information, use the amenityFeature property.
rangeIncludes: BedType
rangeIncludes: Text
rangeIncludes: BedDetails
contributor: STI Accommodation Ontology

annualPercentageRate
type: Property
contributor: FIBO
rangeIncludes: QuantitativeValue
rangeIncludes: Number
comment: The annual rate that is charged for borrowing (or made by investing), expressed as a single percentage number that represents the actual yearly cost of funds over the term of a loan. This includes any fees or additional costs associated with the transaction.
domainIncludes: FinancialProduct

MusicVenue
type: Class
comment: A music venue.
subclass of: CivicStructure

contraindication
type: Property
domainIncludes: MedicalDevice
domainIncludes: MedicalTherapy
rangeIncludes: MedicalContraindication
rangeIncludes: Text
isPartOf: health-lifesci.schema.org
comment: A contraindication for this therapy.

foodEvent
type: Property
sub property of: location
rangeIncludes: FoodEvent
comment: A sub property of location. The specific food event where the action occurred.
domainIncludes: CookAction

cvdNumC19OFMechVentPats
type: Property
source: https://github.com/schemaorg/schemaorg/issues/2521
rangeIncludes: Number
isPartOf: pending.schema.org
domainIncludes: CDCPMDRecord
comment: numc19ofmechventpats - ED/OVERFLOW and VENTILATED: Patients with suspected or confirmed COVID-19 who are in the ED or any overflow location awaiting an inpatient bed and on a mechanical ventilator.

loser
type: Property
comment: A sub property of participant. The loser of the action.
rangeIncludes: Person
sub property of: participant
domainIncludes: WinAction

partOfOrder
type: Property
rangeIncludes: Order
sub property of: refersTo
comment: The overall order the items in this delivery were included in.
domainIncludes: ParcelDelivery
equivalent property: ReferencedOrder

ReserveAction
type: Class
subclass of: PlanAction
comment: Reserving a concrete object.\n\nRelated actions:\n\n* ScheduleAction: Unlike ScheduleAction, ReserveAction reserves concrete objects (e.g. a table, a hotel) towards a time slot / spatial allocation.

lodgingUnitDescription
type: Property
comment: A full description of the lodging unit.
rangeIncludes: Text
domainIncludes: LodgingReservation

Nonprofit501c2
type: USNonprofitType
source: https://github.com/schemaorg/schemaorg/issues/2543
isPartOf: pending.schema.org
comment: Nonprofit501c2: Non-profit type referring to Title-holding Corporations for Exempt Organizations.

arrivalAirport
type: Property
domainIncludes: Flight
comment: The airport where the flight terminates.
rangeIncludes: Airport

targetUrl
type: Property
rangeIncludes: URL
domainIncludes: AlignmentObject
comment: The URL of a node in an established educational framework.

validIn
type: Property
domainIncludes: Certification
domainIncludes: EducationalOccupationalCredential
domainIncludes: Permit
rangeIncludes: AdministrativeArea
comment: The geographic area where the item is valid. Applies for example to a Permit, a Certification, or an EducationalOccupationalCredential.
source: https://github.com/schemaorg/schemaorg/issues/1779

cargoVolume
type: Property
rangeIncludes: QuantitativeValue
domainIncludes: Vehicle
comment: The available volume for cargo or luggage. For automobiles, this is usually the trunk volume.\n\nTypical unit code(s): LTR for liters, FTQ for cubic foot/feet\n\nNote: You can use minValue and maxValue to indicate ranges.
contributor: Automotive Ontology Working Group

securityScreening
type: Property
domainIncludes: FlightReservation
rangeIncludes: Text
comment: The type of security screening the passenger is subject to.

DigitalArtDigitalSource
type: IPTCDigitalSourceEnumeration
source: https://github.com/schemaorg/schemaorg/issues/3392
comment: Content coded as 'digital art' using the IPTC digital source type vocabulary.
isPartOf: pending.schema.org

downPayment
type: Property
contributor: FIBO
isPartOf: pending.schema.org
rangeIncludes: Number
rangeIncludes: MonetaryAmount
source: https://github.com/schemaorg/schemaorg/issues/1253
comment: a type of payment made in cash during the onset of the purchase of an expensive good/service. The payment typically represents only a percentage of the full purchase price.
domainIncludes: RepaymentSpecification

Motel
type: Class
comment: A motel. See also the dedicated document on the use of schema.org for marking up hotels and other forms of accommodations.
subclass of: LodgingBusiness

ItemListOrderAscending
type: ItemListOrderType
comment: An ItemList ordered with lower values listed first.

WearableSizeGroupExtraShort
type: WearableSizeGroupEnumeration
isPartOf: pending.schema.org
comment: Size group "Extra Short" for wearables.
source: https://github.com/schemaorg/schemaorg/issues/2811

departureBusStop
type: Property
domainIncludes: BusTrip
rangeIncludes: BusStop
rangeIncludes: BusStation
comment: The stop or station from which the bus departs.

itemListOrder
type: Property
rangeIncludes: ItemListOrderType
rangeIncludes: Text
comment: Type of ordering (e.g. Ascending, Descending, Unordered).
domainIncludes: ItemList

alcoholWarning
type: Property
isPartOf: health-lifesci.schema.org
rangeIncludes: Text
domainIncludes: Drug
comment: Any precaution, guidance, contraindication, etc. related to consumption of alcohol while taking this drug.

educationalRole
type: Property
rangeIncludes: Text
comment: An educationalRole of an EducationalAudience.
domainIncludes: EducationalAudience

Recruiting
type: MedicalStudyStatus
comment: Recruiting participants.
isPartOf: health-lifesci.schema.org

translator
type: Property
domainIncludes: Event
domainIncludes: CreativeWork
rangeIncludes: Organization
rangeIncludes: Person
comment: Organization or person who adapts a creative work to different languages, regional differences and technical requirements of a target market, or that translates during some event.

shippingConditions
type: Property
isPartOf: pending.schema.org
rangeIncludes: ShippingConditions
domainIncludes: ShippingService
comment: The conditions (constraints, price) applicable to the ShippingService.
source: https://github.com/schemaorg/schemaorg/issues/3617

geoMidpoint
type: Property
comment: Indicates the GeoCoordinates at the centre of a GeoShape, e.g. GeoCircle.
domainIncludes: GeoCircle
rangeIncludes: GeoCoordinates

SeaBodyOfWater
type: Class
subclass of: BodyOfWater
comment: A sea (for example, the Caspian sea).

ProfessionalService
type: Class
subclass of: LocalBusiness
comment: Original definition: "provider of professional services."\n\nThe general ProfessionalService type for local businesses was deprecated due to confusion with Service. For reference, the types that it included were: Dentist, AccountingService, Attorney, Notary, as well as types for several kinds of HomeAndConstructionBusiness: Electrician, GeneralContractor, HousePainter, Locksmith, Plumber, RoofingContractor. LegalService was introduced as a more inclusive supertype of Attorney.

afterMedia
type: Property
rangeIncludes: MediaObject
rangeIncludes: URL
domainIncludes: HowToDirection
comment: A media object representing the circumstances after performing this direction.

operatingSystem
type: Property
rangeIncludes: OperatingSystem
rangeIncludes: Text
domainIncludes: SoftwareApplication
comment: Operating systems supported (Windows 7, OS X 10.6, Android 1.6).

servicePhone
type: Property
rangeIncludes: ContactPoint
sub property of: hasAddress
domainIncludes: ServiceChannel
comment: The phone number to use to access the service.

releaseNotes
type: Property
domainIncludes: SoftwareApplication
rangeIncludes: URL
rangeIncludes: Text
comment: Description of what changed in this version.

diet
type: Property
comment: A sub property of instrument. The diet used in this action.
isPartOf: health-lifesci.schema.org
rangeIncludes: Diet
sub property of: instrument
domainIncludes: ExerciseAction

TaxiVehicleUsage
type: CarUsageType
contributor: Automotive Ontology Working Group
comment: Indicates the usage of the car as a taxi.
isPartOf: auto.schema.org

mpn
type: Property
comment: The Manufacturer Part Number (MPN) of the product, or the product to which the offer refers.
domainIncludes: Product
domainIncludes: Demand
domainIncludes: Offer
equivalent property: manufacturerAssignedId
rangeIncludes: Text
contributor: GoodRelationsTerms

Nonprofit501c28
type: USNonprofitType
source: https://github.com/schemaorg/schemaorg/issues/2543
comment: Nonprofit501c28: Non-profit type referring to National Railroad Retirement Investment Trusts.
isPartOf: pending.schema.org

actionableFeedbackPolicy
type: Property
rangeIncludes: CreativeWork
rangeIncludes: URL
comment: For a NewsMediaOrganization or other news-related Organization, a statement about public engagement activities (for news media, the newsroom’s), including involving the public - digitally or otherwise -- in coverage decisions, reporting and activities after publication.
source: https://github.com/schemaorg/schemaorg/issues/1525
contributor: TP
domainIncludes: NewsMediaOrganization
domainIncludes: Organization
sub property of: publishingPrinciples
isPartOf: pending.schema.org

molecularWeight
type: Property
domainIncludes: MolecularEntity
rangeIncludes: QuantitativeValue
rangeIncludes: Text
comment: This is the molecular weight of the entity being described, not of the parent. Units should be included in the form '<Number> <unit>', for example '12 amu' or as '<QuantitativeValue>.
isPartOf: pending.schema.org
source: MolecularEntity

birthPlace
type: Property
comment: The place where the person was born.
rangeIncludes: Place
domainIncludes: Person

fuelType
type: Property
rangeIncludes: URL
rangeIncludes: Text
rangeIncludes: QualitativeValue
domainIncludes: Vehicle
domainIncludes: EngineSpecification
comment: The type of fuel suitable for the engine or engines of the vehicle. If the vehicle has only one engine, this property can be attached directly to the vehicle.
contributor: Automotive Ontology Working Group

additionalNumberOfGuests
type: Property
domainIncludes: RsvpAction
rangeIncludes: Number
comment: If responding yes, the number of guests who will attend in addition to the invitee.

safetyConsideration
type: Property
isPartOf: health-lifesci.schema.org
comment: Any potential safety concern associated with the supplement. May include interactions with other drugs and foods, pregnancy, breastfeeding, known adverse reactions, and documented efficacy of the supplement.
rangeIncludes: Text
domainIncludes: DietarySupplement

FulfillmentTypePickupDropoff
type: FulfillmentTypeEnumeration
comment: Fulfillment through pick-up drop-off locations.
source: https://github.com/schemaorg/schemaorg/issues/3617
isPartOf: pending.schema.org

ApprovedIndication
type: Class
isPartOf: health-lifesci.schema.org
comment: An indication for a medical therapy that has been formally specified or approved by a regulatory body that regulates use of the therapy; for example, the US FDA approves indications for most drugs in the US.
subclass of: MedicalIndication

payload
type: Property
isPartOf: auto.schema.org
rangeIncludes: QuantitativeValue
contributor: Automotive Ontology Working Group
domainIncludes: Vehicle
comment: The permitted weight of passengers and cargo, EXCLUDING the weight of the empty vehicle.\n\nTypical unit code(s): KGM for kilogram, LBR for pound\n\n* Note 1: Many databases specify the permitted TOTAL weight instead, which is the sum of weight and payload\n* Note 2: You can indicate additional information in the name of the QuantitativeValue node.\n* Note 3: You may also link to a QualitativeValue node that provides additional information using valueReference.\n* Note 4: Note that you can use minValue and maxValue to indicate ranges.

GatedResidenceCommunity
type: Class
subclass of: Residence
comment: Residence type: Gated community.

reviewCount
type: Property
domainIncludes: AggregateRating
comment: The count of total number of reviews.
rangeIncludes: Integer

UnofficialLegalValue
type: LegalValueLevel
source: https://github.com/schemaorg/schemaorg/issues/1156
source: eli
contributor: ELI
comment: Indicates that a document has no particular or special standing (e.g. a republication of a law by a private publisher).
isPartOf: pending.schema.org

UserCheckins
type: Class
subclass of: UserInteraction
comment: UserInteraction and its subtypes is an old way of talking about users interacting with pages. It is generally better to use Action-based vocabulary, alongside types such as Comment.
supersededBy: InteractionCounter

faxNumber
type: Property
domainIncludes: ContactPoint
domainIncludes: Person
domainIncludes: Organization
domainIncludes: Place
comment: The fax number.
equivalent property: faxNumber
rangeIncludes: Text

numberOfAxles
type: Property
domainIncludes: Vehicle
comment: The number of axles.\n\nTypical unit code(s): C62.
rangeIncludes: QuantitativeValue
rangeIncludes: Number
contributor: Automotive Ontology Working Group

encodingType
type: Property
comment: The supported encoding type(s) for an EntryPoint request.
domainIncludes: EntryPoint
rangeIncludes: Text

lesser
type: Property
domainIncludes: QualitativeValue
rangeIncludes: QualitativeValue
contributor: GoodRelationsTerms
comment: This ordering relation for qualitative values indicates that the subject is lesser than the object.

regionDrained
type: Property
rangeIncludes: AnatomicalSystem
rangeIncludes: AnatomicalStructure
isPartOf: health-lifesci.schema.org
comment: The anatomical or organ system drained by this vessel; generally refers to a specific part of an organ.
domainIncludes: Vein
domainIncludes: LymphaticVessel

inker
type: Property
comment: The individual who traces over the pencil drawings in ink after pencils are complete.
rangeIncludes: Person
domainIncludes: VisualArtwork
domainIncludes: ComicStory
domainIncludes: ComicIssue
isPartOf: bib.schema.org

weight
type: Property
rangeIncludes: Mass
rangeIncludes: QuantitativeValue
domainIncludes: Person
domainIncludes: VisualArtwork
domainIncludes: OfferShippingDetails
domainIncludes: ShippingConditions
domainIncludes: Product
source: https://github.com/schemaorg/schemaorg/issues/3617
contributor: GoodRelationsTerms
comment: The weight of the product or person.

downloadUrl
type: Property
domainIncludes: SoftwareApplication
rangeIncludes: URL
comment: If the file can be downloaded, URL to download the binary.

creditText
type: Property
domainIncludes: CreativeWork
source: https://github.com/schemaorg/schemaorg/issues/2659
rangeIncludes: Text
isPartOf: pending.schema.org
comment: Text that can be used to credit person(s) and/or organization(s) associated with a published Creative Work.

worksFor
type: Property
domainIncludes: Person
rangeIncludes: Organization
comment: Organizations that the person works for.

hasDigitalDocumentPermission
type: Property
rangeIncludes: DigitalDocumentPermission
comment: A permission related to the access to this document (e.g. permission to read or write an electronic document). For a public document, specify a grantee with an Audience with audienceType equal to "public".
domainIncludes: DigitalDocument

wheelbase
type: Property
comment: The distance between the centers of the front and rear wheels.\n\nTypical unit code(s): CMT for centimeters, MTR for meters, INH for inches, FOT for foot/feet.
contributor: Automotive Ontology Working Group
domainIncludes: Vehicle
rangeIncludes: QuantitativeValue
isPartOf: auto.schema.org

encodings
type: Property
supersededBy: encoding
comment: A media object that encodes this CreativeWork.
domainIncludes: CreativeWork
rangeIncludes: MediaObject

encoding
type: Property
comment: A media object that encodes this CreativeWork. This property is a synonym for associatedMedia.
inverseOf: encodesCreativeWork
domainIncludes: CreativeWork
rangeIncludes: MediaObject

PublicToilet
type: Class
subclass of: CivicStructure
comment: A public toilet is a room or small building containing one or more toilets (and possibly also urinals) which is available for use by the general public, or by customers or employees of certain businesses.
source: https://github.com/schemaorg/schemaorg/issues/1624
isPartOf: pending.schema.org

applicationContact
type: Property
domainIncludes: JobPosting
source: https://github.com/schemaorg/schemaorg/issues/2396
comment: Contact details for further information relevant to this job posting.
isPartOf: pending.schema.org
rangeIncludes: ContactPoint

CommunityHealth
type: MedicalSpecialty
subclass of: MedicalBusiness
comment: A field of public health focusing on improving health characteristics of a defined population in relation with their geographical or environment areas.
isPartOf: health-lifesci.schema.org

occupationalCategory
type: Property
source: https://github.com/schemaorg/schemaorg/issues/2289
source: https://github.com/schemaorg/schemaorg/issues/1698
source: https://github.com/schemaorg/schemaorg/issues/2192
source: https://github.com/schemaorg/schemaorg/issues/2460
source: https://github.com/schemaorg/schemaorg/issues/3420
domainIncludes: Physician
domainIncludes: JobPosting
domainIncludes: Occupation
domainIncludes: EducationalOccupationalProgram
domainIncludes: WorkBasedProgram
rangeIncludes: Text
rangeIncludes: CategoryCode
isPartOf: pending.schema.org
comment: A category describing the job, preferably using a term from a taxonomy such as [BLS O*NET-SOC](http://www.onetcenter.org/taxonomy.html), [ISCO-08](https://www.ilo.org/public/english/bureau/stat/isco/isco08/) or similar, with the property repeated for each applicable value. Ideally the taxonomy should be identified, and both the textual label and formal code for the category should be provided.\n Note: for historical reasons, any textual label and formal code provided as a literal may be assumed to be from O*NET-SOC.

WearableMeasurementWidth
type: WearableMeasurementTypeEnumeration
source: https://github.com/schemaorg/schemaorg/issues/2811
isPartOf: pending.schema.org
comment: Measurement of the width, for example of shoes.

productionDate
type: Property
comment: The date of production of the item, e.g. vehicle.
contributor: Automotive Ontology Working Group
domainIncludes: Vehicle
domainIncludes: Product
rangeIncludes: Date
equivalent property: ProductionDate

disambiguatingDescription
type: Property
rangeIncludes: Text
comment: A sub property of description. A short description of the item used to disambiguate from other, similar items. Information from other properties (in particular, name) may be necessary for the description to be useful for disambiguation.
sub property of: description
domainIncludes: Thing

browserRequirements
type: Property
comment: Specifies browser requirements in human-readable text. For example, 'requires HTML5 support'.
rangeIncludes: Text
domainIncludes: WebApplication

ratingExplanation
type: Property
isPartOf: pending.schema.org
comment: A short explanation (e.g. one to two sentences) providing background context and other information that led to the conclusion expressed in the rating. This is particularly applicable to ratings associated with "fact check" markup using ClaimReview.
source: https://github.com/schemaorg/schemaorg/issues/2300
domainIncludes: Rating
rangeIncludes: Text

copyrightNotice
type: Property
domainIncludes: CreativeWork
isPartOf: pending.schema.org
comment: Text of a notice appropriate for describing the copyright aspects of this Creative Work, ideally indicating the owner of the copyright for the Work.
rangeIncludes: Text
source: https://github.com/schemaorg/schemaorg/issues/2659

StrengthTraining
type: PhysicalActivityCategory
comment: Physical activity that is engaged in to improve muscle and bone strength. Also referred to as resistance training.
isPartOf: health-lifesci.schema.org

agentInteractionStatistic
type: Property
comment: The number of completed interactions for this entity, in a particular role (the 'agent'), in a particular action (indicated in the statistic), and in a particular context (i.e. interactionService).
rangeIncludes: InteractionCounter
isPartOf: pending.schema.org
source: https://github.com/schemaorg/schemaorg/issues/2858
domainIncludes: Person
domainIncludes: Organization

SRP
type: PriceTypeEnumeration
comment: Represents the suggested retail price ("SRP") of an offered product.
isPartOf: pending.schema.org
source: https://github.com/schemaorg/schemaorg/issues/2712

expectedPrognosis
type: Property
rangeIncludes: Text
domainIncludes: MedicalCondition
comment: The likely outcome in either the short term or long term of the medical condition.
isPartOf: health-lifesci.schema.org

downvoteCount
type: Property
rangeIncludes: Integer
domainIncludes: Comment
comment: The number of downvotes this question, answer or comment has received from the community.

legislationIdentifier
type: Property
rangeIncludes: Text
rangeIncludes: URL
source: eli
source: https://github.com/schemaorg/schemaorg/issues/1156
isPartOf: pending.schema.org
sub property of: identifier
comment: An identifier for the legislation. This can be either a string-based identifier, like the CELEX at EU level or the NOR in France, or a web-based, URL/URI identifier, like an ELI (European Legislation Identifier) or an URN-Lex.
domainIncludes: Legislation
contributor: ELI

ResearchOrganization
type: Class
subclass of: Organization
isPartOf: pending.schema.org
comment: A Research Organization (e.g. scientific institute, research company).
source: https://github.com/schemaorg/schemaorg/issues/2877

ParkingMap
type: MapCategoryType
comment: A parking map.

IceCreamShop
type: Class
subclass of: FoodEstablishment
comment: An ice cream shop.

eligibleTransactionVolume
type: Property
domainIncludes: PriceSpecification
domainIncludes: Offer
domainIncludes: Demand
comment: The transaction volume, in a monetary unit, for which the offer or price specification is valid, e.g. for indicating a minimal purchasing volume, to express free shipping above a certain order volume, or to limit the acceptance of credit cards to purchases to a certain minimal amount.
rangeIncludes: PriceSpecification
contributor: GoodRelationsTerms

accelerationTime
type: Property
comment: The time needed to accelerate the vehicle from a given start velocity to a given target velocity.\n\nTypical unit code(s): SEC for seconds\n\n* Note: There are unfortunately no standard unit codes for seconds/0..100 km/h or seconds/0..60 mph. Simply use "SEC" for seconds and indicate the velocities in the name of the QuantitativeValue, or use valueReference with a QuantitativeValue of 0..60 mph or 0..100 km/h to specify the reference speeds.
contributor: Automotive Ontology Working Group
rangeIncludes: QuantitativeValue
domainIncludes: Vehicle
isPartOf: auto.schema.org

source
type: Property
isPartOf: pending.schema.org
comment: The source or cause of the event.
rangeIncludes: Thing
source: https://github.com/schemaorg/schemaorg/issues/4527
domainIncludes: InstantaneousEvent

WesternConventional
type: MedicineSystem
comment: The conventional Western system of medicine, that aims to apply the best available evidence gained from the scientific method to clinical decision making. Also known as conventional or Western medicine.
isPartOf: health-lifesci.schema.org

VirtualRecordingDigitalSource
type: IPTCDigitalSourceEnumeration
source: https://github.com/schemaorg/schemaorg/issues/3392
comment: Content coded as 'virtual recording' using the IPTC digital source type vocabulary.
isPartOf: pending.schema.org

isInvolvedInBiologicalProcess
type: Property
isPartOf: pending.schema.org
source: BioChemEntity
domainIncludes: BioChemEntity
comment: Biological process this BioChemEntity is involved in; please use PropertyValue if you want to include any evidence.
rangeIncludes: DefinedTerm
rangeIncludes: URL
rangeIncludes: PropertyValue

geoWithin
type: Property
domainIncludes: GeospatialGeometry
domainIncludes: Place
rangeIncludes: GeospatialGeometry
rangeIncludes: Place
comment: Represents a relationship between two geometries (or the places they represent), relating a geometry to one that contains it, i.e. it is inside (i.e. within) its interior. As defined in [DE-9IM](https://en.wikipedia.org/wiki/DE-9IM).

embeddedTextCaption
type: Property
source: https://github.com/schemaorg/schemaorg/issues/2450
rangeIncludes: Text
domainIncludes: ImageObject
domainIncludes: VideoObject
domainIncludes: AudioObject
isPartOf: pending.schema.org
sub property of: caption
comment: Represents textual captioning from a MediaObject, e.g. text of a 'meme'.

caption
type: Property
rangeIncludes: Text
rangeIncludes: MediaObject
domainIncludes: ImageObject
domainIncludes: VideoObject
domainIncludes: AudioObject
comment: The caption for this object. For downloadable machine formats (closed caption, subtitles etc.) use MediaObject and indicate the encodingFormat.

WearableSizeGroupJuniors
type: WearableSizeGroupEnumeration
comment: Size group "Juniors" for wearables.
source: https://github.com/schemaorg/schemaorg/issues/2811
isPartOf: pending.schema.org

workLocation
type: Property
rangeIncludes: Place
rangeIncludes: ContactPoint
sub property of: location
domainIncludes: Person
comment: A contact location for a person's place of work.

tripOrigin
type: Property
rangeIncludes: Place
domainIncludes: Trip
comment: The location of origin of the trip, prior to any destination(s).

accountablePerson
type: Property
comment: Specifies the Person that is legally accountable for the CreativeWork.
rangeIncludes: Person
domainIncludes: CreativeWork

supplyTo
type: Property
comment: The area to which the artery supplies blood.
isPartOf: health-lifesci.schema.org
domainIncludes: Artery
rangeIncludes: AnatomicalStructure

Pharmacy
type: Class
subclass of: MedicalOrganization
subclass of: MedicalBusiness
comment: A pharmacy or drugstore.

billingDuration
type: Property
isPartOf: pending.schema.org
source: https://github.com/schemaorg/schemaorg/issues/2689
comment: Specifies for how long this price (or price component) will be billed. Can be used, for example, to model the contractual duration of a subscription or payment plan. Type can be either a Duration or a Number (in which case the unit of measurement, for example month, is specified by the unitCode property).
rangeIncludes: Duration
rangeIncludes: QuantitativeValue
rangeIncludes: Number
domainIncludes: UnitPriceSpecification

totalJobOpenings
type: Property
isPartOf: pending.schema.org
comment: The number of positions open for this job posting. Use a positive integer. Do not use if the number of positions is unclear or not known.
source: https://github.com/schemaorg/schemaorg/issues/2329
rangeIncludes: Integer
domainIncludes: JobPosting

loanRepaymentForm
type: Property
source: https://github.com/schemaorg/schemaorg/issues/1253
domainIncludes: LoanOrCredit
rangeIncludes: RepaymentSpecification
contributor: FIBO
isPartOf: pending.schema.org
comment: A form of paying back money previously borrowed from a lender. Repayment usually takes the form of periodic payments that normally include part principal plus interest in each payment.

athlete
type: Property
comment: A person that acts as performing member of a sports team; a player as opposed to a coach.
domainIncludes: SportsTeam
rangeIncludes: Person

UserReview
type: Class
subclass of: Review
source: https://github.com/schemaorg/schemaorg/issues/1589
isPartOf: pending.schema.org
comment: A review created by an end-user (e.g. consumer, purchaser, attendee etc.), in contrast with CriticReview.

inCodeSet
type: Property
source: https://github.com/schemaorg/schemaorg/issues/894
rangeIncludes: CategoryCodeSet
rangeIncludes: URL
sub property of: inDefinedTermSet
domainIncludes: CategoryCode
comment: A CategoryCodeSet that contains this category code.
isPartOf: pending.schema.org

inDefinedTermSet
type: Property
isPartOf: pending.schema.org
sub property of: isPartOf
rangeIncludes: URL
rangeIncludes: DefinedTermSet
source: https://github.com/schemaorg/schemaorg/issues/894
comment: A DefinedTermSet that contains this term.
domainIncludes: DefinedTerm

nonProprietaryName
type: Property
rangeIncludes: Text
domainIncludes: DietarySupplement
domainIncludes: Drug
comment: The generic name of this drug or supplement.
isPartOf: health-lifesci.schema.org

upvoteCount
type: Property
domainIncludes: Comment
comment: The number of upvotes this question, answer or comment has received from the community.
rangeIncludes: Integer

Prion
type: InfectiousAgentClass
comment: A prion is an infectious agent composed of protein in a misfolded form.
isPartOf: health-lifesci.schema.org

speakable
type: Property
rangeIncludes: URL
rangeIncludes: SpeakableSpecification
domainIncludes: Article
domainIncludes: WebPage
comment: Indicates sections of a Web page that are particularly 'speakable' in the sense of being highlighted as being especially appropriate for text-to-speech conversion. Other sections of a page may also be usefully spoken in particular circumstances; the 'speakable' property serves to indicate the parts most likely to be generally useful for speech. The *speakable* property can be repeated an arbitrary number of times, with three kinds of possible 'content-locator' values: 1.) *id-value* URL references - uses *id-value* of an element in the page being annotated. The simplest use of *speakable* has (potentially relative) URL values, referencing identified sections of the document concerned. 2.) CSS Selectors - addresses content in the annotated page, e.g. via class attribute. Use the cssSelector property. 3.) XPaths - addresses content via XPaths (assuming an XML view of the content). Use the xpath property. For more sophisticated markup of speakable sections beyond simple ID references, either CSS selectors or XPath expressions to pick out document section(s) as speakable. For this we define a supporting type, SpeakableSpecification which is defined to be a possible value of the *speakable* property.
source: https://github.com/schemaorg/schemaorg/issues/1389

numberedPosition
type: Property
domainIncludes: OrganizationRole
rangeIncludes: Number
comment: A number associated with a role in an organization, for example, the number on an athlete's jersey.

SportingGoodsStore
type: Class
comment: A sporting goods store.
subclass of: Store

assesses
type: Property
source: https://github.com/schemaorg/schemaorg/issues/2427
domainIncludes: CreativeWork
domainIncludes: LearningResource
domainIncludes: EducationEvent
isPartOf: pending.schema.org
rangeIncludes: DefinedTerm
rangeIncludes: Text
comment: The item being described is intended to assess the competency or learning outcome defined by the referenced term.

GraphicNovel
type: BookFormatType
comment: This type is deprecated: GraphicNovel does not fit the BookFormatType enumeration, as it can appear in multiple formats (e.g., Hardcover, eBook). It is not mutually exclusive and therefore deprecated. Use standard BookFormatType values instead in combination with the SequentialArt. Book format: GraphicNovel. May represent a bound collection of ComicIssue instances.
isPartOf: bib.schema.org

Nonprofit501c16
type: USNonprofitType
comment: Nonprofit501c16: Non-profit type referring to Cooperative Organizations to Finance Crop Operations.
isPartOf: pending.schema.org
source: https://github.com/schemaorg/schemaorg/issues/2543

PurchaseTypeNewPurchase
type: PurchaseType
source: https://github.com/schemaorg/schemaorg/issues/3572
isPartOf: pending.schema.org
comment: This is a purchase of a new item.

postalCodeBegin
type: Property
comment: First postal code in a range (included).
rangeIncludes: Text
sub property of: hasLowerBound
domainIncludes: PostalCodeRangeSpecification
source: https://github.com/schemaorg/schemaorg/issues/2506

bccRecipient
type: Property
rangeIncludes: Person
rangeIncludes: Organization
rangeIncludes: ContactPoint
sub property of: recipient
comment: A sub property of recipient. The recipient blind copied on a message.
domainIncludes: Message

recipient
type: Property
domainIncludes: GiveAction
domainIncludes: TipAction
domainIncludes: Message
domainIncludes: PayAction
domainIncludes: SendAction
domainIncludes: AuthorizeAction
domainIncludes: DonateAction
domainIncludes: ReturnAction
domainIncludes: CommunicateAction
comment: A sub property of participant. The participant who is at the receiving end of the action.
rangeIncludes: ContactPoint
rangeIncludes: Person
rangeIncludes: Organization
rangeIncludes: Audience
sub property of: participant

IncentiveStatusActive
type: IncentiveStatus
isPartOf: pending.schema.org
source: https://github.com/schemaorg/schemaorg/issues/3572
comment: This incentive is currently active.

warning
type: Property
rangeIncludes: URL
rangeIncludes: Text
comment: Any FDA or other warnings about the drug (text or URL).
isPartOf: health-lifesci.schema.org
domainIncludes: Drug

AudiobookFormat
type: BookFormatType
comment: Book format: Audiobook. This is an enumerated value for use with the bookFormat property. There is also a type 'Audiobook' in the bib extension which includes Audiobook specific properties.

BackOrder
type: ItemAvailability
comment: Indicates that the item is available on back order.

percentile75
type: Property
domainIncludes: QuantitativeValueDistribution
comment: The 75th percentile value.
source: https://github.com/schemaorg/schemaorg/issues/1698
rangeIncludes: Number

serviceOperator
type: Property
domainIncludes: GovernmentService
comment: The operating organization, if different from the provider. This enables the representation of services that are provided by an organization, but operated by another organization like a subcontractor.
rangeIncludes: Organization

requiresSubscription
type: Property
domainIncludes: MediaObject
domainIncludes: ActionAccessSpecification
rangeIncludes: Boolean
rangeIncludes: MediaSubscription
comment: Indicates if use of the media require a subscription (either paid or free). Allowed values are ```true``` or ```false``` (note that an earlier version had 'yes', 'no').
source: https://github.com/schemaorg/schemaorg/issues/1741

ConfirmAction
type: Class
subclass of: InformAction
comment: The act of notifying someone that a future event/action is going to happen as expected.\n\nRelated actions:\n\n* CancelAction: The antonym of ConfirmAction.

RisksOrComplicationsHealthAspect
type: HealthAspectEnumeration
isPartOf: pending.schema.org
source: https://github.com/schemaorg/schemaorg/issues/2374
comment: Information about the risk factors and possible complications that may follow a topic.

associatedClaimReview
type: Property
comment: An associated ClaimReview, related by specific common content, topic or claim. The expectation is that this property would be most typically used in cases where a single activity is conducting both claim reviews and media reviews, in which case relatedMediaReview would commonly be used on a ClaimReview, while relatedClaimReview would be used on MediaReview.
source: https://github.com/schemaorg/schemaorg/issues/2450
rangeIncludes: Review
isPartOf: pending.schema.org
domainIncludes: Review
sub property of: associatedReview

associatedReview
type: Property
rangeIncludes: Review
source: https://github.com/schemaorg/schemaorg/issues/2450
domainIncludes: Review
comment: An associated Review.
isPartOf: pending.schema.org

maintainer
type: Property
source: https://github.com/schemaorg/schemaorg/issues/2311
rangeIncludes: Person
rangeIncludes: Organization
comment: A maintainer of a Dataset, software package (SoftwareApplication), or other Project. A maintainer is a Person or Organization that manages contributions to, and/or publication of, some (typically complex) artifact. It is common for distributions of software and data to be based on "upstream" sources. When maintainer is applied to a specific version of something e.g. a particular version or packaging of a Dataset, it is always possible that the upstream source has a different maintainer. The isBasedOn property can be used to indicate such relationships between datasets to make the different maintenance roles clear. Similarly in the case of software, a package may have dedicated maintainers working on integration into software distributions such as Ubuntu, as well as upstream maintainers of the underlying work.
isPartOf: pending.schema.org
domainIncludes: CreativeWork

Nonprofit501k
type: USNonprofitType
source: https://github.com/schemaorg/schemaorg/issues/2543
comment: Nonprofit501k: Non-profit type referring to Child Care Organizations.
isPartOf: pending.schema.org

sha256
type: Property
comment: The [SHA-2](https://en.wikipedia.org/wiki/SHA-2) SHA256 hash of the content of the item. For example, a zero-length input has value 'e3b0c44298fc1c149afbf4c8996fb92427ae41e4649b934ca495991b7852b855'.
sub property of: description
source: https://github.com/schemaorg/schemaorg/issues/2450
rangeIncludes: Text
domainIncludes: MediaObject
isPartOf: pending.schema.org

educationalAlignment
type: Property
rangeIncludes: AlignmentObject
domainIncludes: LearningResource
domainIncludes: CreativeWork
comment: An alignment to an established educational framework. This property should not be used where the nature of the alignment can be described using a simple property, for example to express that a resource teaches or assesses a competency.

foodEstablishment
type: Property
rangeIncludes: Place
rangeIncludes: FoodEstablishment
sub property of: location
domainIncludes: CookAction
comment: A sub property of location. The specific food establishment where the action occurred.

archivedAt
type: Property
source: https://github.com/schemaorg/schemaorg/issues/2450
rangeIncludes: WebPage
rangeIncludes: URL
comment: Indicates a page or other link involved in archival of a CreativeWork. In the case of MediaReview, the items in a MediaReviewItem may often become inaccessible, but be archived by archival, journalistic, activist, or law enforcement organizations. In such cases, the referenced page may not directly publish the content.
isPartOf: pending.schema.org
domainIncludes: CreativeWork

engineDisplacement
type: Property
isPartOf: auto.schema.org
contributor: Automotive Ontology Working Group
comment: The volume swept by all of the pistons inside the cylinders of an internal combustion engine in a single movement. \n\nTypical unit code(s): CMQ for cubic centimeter, LTR for liters, INQ for cubic inches\n* Note 1: You can link to information about how the given value has been determined using the valueReference property.\n* Note 2: You can use minValue and maxValue to indicate ranges.
rangeIncludes: QuantitativeValue
domainIncludes: EngineSpecification

hiringOrganization
type: Property
rangeIncludes: Person
rangeIncludes: Organization
comment: Organization or Person offering the job position.
domainIncludes: JobPosting

recourseLoan
type: Property
source: https://github.com/schemaorg/schemaorg/issues/1253
rangeIncludes: Boolean
comment: The only way you get the money back in the event of default is the security. Recourse is where you still have the opportunity to go back to the borrower for the rest of the money.
domainIncludes: LoanOrCredit
contributor: FIBO
isPartOf: pending.schema.org

target
type: Property
comment: Indicates a target EntryPoint, or url, for an Action.
domainIncludes: Action
rangeIncludes: EntryPoint
rangeIncludes: URL

UserBlocks
type: Class
supersededBy: InteractionCounter
subclass of: UserInteraction
comment: UserInteraction and its subtypes is an old way of talking about users interacting with pages. It is generally better to use Action-based vocabulary, alongside types such as Comment.

PodcastEpisode
type: Class
subclass of: Episode
source: https://github.com/schemaorg/schemaorg/issues/373
isPartOf: pending.schema.org
comment: A single episode of a podcast series.

bookingAgent
type: Property
supersededBy: broker
rangeIncludes: Organization
rangeIncludes: Person
domainIncludes: Reservation
comment: 'bookingAgent' is an out-dated term indicating a 'broker' that serves as a booking agent.

broker
type: Property
rangeIncludes: Person
rangeIncludes: Organization
domainIncludes: Reservation
domainIncludes: Invoice
domainIncludes: Order
domainIncludes: Service
comment: An entity that arranges for an exchange between a buyer and a seller. In most cases a broker never acquires or releases ownership of a product or service involved in an exchange. If it is not clear whether an entity is a broker, seller, or buyer, the latter two terms are preferred.

ComedyEvent
type: Class
comment: Event type: Comedy event.
subclass of: Event

Nonprofit501c15
type: USNonprofitType
comment: Nonprofit501c15: Non-profit type referring to Mutual Insurance Companies or Associations.
source: https://github.com/schemaorg/schemaorg/issues/2543
isPartOf: pending.schema.org

checkoutTime
type: Property
rangeIncludes: DateTime
rangeIncludes: Time
comment: The latest someone may check out of a lodging establishment.
domainIncludes: LodgingBusiness
domainIncludes: LodgingReservation

geoEquals
type: Property
rangeIncludes: GeospatialGeometry
rangeIncludes: Place
domainIncludes: Place
domainIncludes: GeospatialGeometry
comment: Represents spatial relations in which two geometries (or the places they represent) are topologically equal, as defined in [DE-9IM](https://en.wikipedia.org/wiki/DE-9IM). "Two geometries are topologically equal if their interiors intersect and no part of the interior or boundary of one geometry intersects the exterior of the other" (a symmetric relationship).

variableMeasured
type: Property
isPartOf: pending.schema.org
rangeIncludes: Property
rangeIncludes: PropertyValue
rangeIncludes: Text
rangeIncludes: StatisticalVariable
source: https://github.com/schemaorg/schemaorg/issues/1083
comment: The variableMeasured property can indicate (repeated as necessary) the variables that are measured in some dataset, either described as text or as pairs of identifier and description using PropertyValue, or more explicitly as a StatisticalVariable.
domainIncludes: Observation
domainIncludes: Dataset

populationType
type: Property
domainIncludes: StatisticalVariable
domainIncludes: StatisticalPopulation
rangeIncludes: Class
isPartOf: pending.schema.org
source: https://github.com/schemaorg/schemaorg/issues/2291
comment: Indicates the populationType common to all members of a StatisticalPopulation or all cases within the scope of a StatisticalVariable.

WearableMeasurementCollar
type: WearableMeasurementTypeEnumeration
comment: Measurement of the collar, for example of a shirt.
source: https://github.com/schemaorg/schemaorg/issues/2811
isPartOf: pending.schema.org

availableService
type: Property
domainIncludes: Hospital
domainIncludes: Physician
domainIncludes: MedicalClinic
rangeIncludes: MedicalProcedure
rangeIncludes: MedicalTest
rangeIncludes: MedicalTherapy
isPartOf: health-lifesci.schema.org
comment: A medical service available from this provider.

webFeed
type: Property
domainIncludes: PodcastSeries
domainIncludes: SpecialAnnouncement
comment: The URL for a feed, e.g. associated with a podcast series, blog, or series of date-stamped updates. This is usually RSS or Atom.
source: https://github.com/schemaorg/schemaorg/issues/373
isPartOf: pending.schema.org
rangeIncludes: DataFeed
rangeIncludes: URL

publishedBy
type: Property
comment: An agent associated with the publication event.
rangeIncludes: Person
rangeIncludes: Organization
isPartOf: bib.schema.org
domainIncludes: PublicationEvent

TierBenefitLoyaltyReturns
type: TierBenefitEnumeration
source: https://github.com/schemaorg/schemaorg/issues/3563
isPartOf: pending.schema.org
comment: Benefit of the tier is members-only returns, for example free unlimited returns.

CDFormat
type: MusicReleaseFormatType
contributor: MBZ
comment: CDFormat.

validFor
type: Property
comment: The duration of validity of a permit or similar thing.
source: https://github.com/schemaorg/schemaorg/issues/1779
domainIncludes: EducationalOccupationalCredential
domainIncludes: Permit
rangeIncludes: Duration

specialCommitments
type: Property
comment: Any special commitments associated with this job posting. Valid entries include VeteranCommit, MilitarySpouseCommit, etc.
domainIncludes: JobPosting
rangeIncludes: Text

WearableSizeSystemBR
type: WearableSizeSystemEnumeration
comment: Brazilian size system for wearables.
source: https://github.com/schemaorg/schemaorg/issues/2811
isPartOf: pending.schema.org

legislationLegalForce
type: Property
source: eli
source: https://github.com/schemaorg/schemaorg/issues/1156
equivalent property: in force
isPartOf: pending.schema.org
comment: Whether the legislation is currently in force, not in force, or partially in force.
rangeIncludes: LegalForceStatus
domainIncludes: Legislation
contributor: ELI

paymentAccepted
type: Property
comment: Cash, Credit Card, Cryptocurrency, Local Exchange Tradings System, etc.
domainIncludes: LocalBusiness
rangeIncludes: Text

serviceType
type: Property
rangeIncludes: Text
rangeIncludes: GovernmentBenefitsType
comment: The type of service being offered, e.g. veterans' benefits, emergency relief, etc.
domainIncludes: Service

editEIDR
type: Property
comment: An [EIDR](https://eidr.org/) (Entertainment Identifier Registry) identifier representing a specific edit / edition for a work of film or television. For example, the motion picture known as "Ghostbusters" whose titleEIDR is "10.5240/7EC7-228A-510A-053E-CBB8-J" has several edits, e.g. "10.5240/1F2A-E1C5-680A-14C6-E76B-I" and "10.5240/8A35-3BEE-6497-5D12-9E4F-3". Since schema.org types like Movie and TVEpisode can be used for both works and their multiple expressions, it is possible to use titleEIDR alone (for a general description), or alongside editEIDR for a more edit-specific description.
isPartOf: pending.schema.org
domainIncludes: CreativeWork
source: https://github.com/schemaorg/schemaorg/issues/2469
sub property of: identifier
rangeIncludes: URL
rangeIncludes: Text

BodyMeasurementNeck
type: BodyMeasurementTypeEnumeration
comment: Girth of neck. Used, for example, to fit shirts.
isPartOf: pending.schema.org
source: https://github.com/schemaorg/schemaorg/issues/2811

cookingMethod
type: Property
comment: The method of cooking, such as Frying, Steaming, ...
domainIncludes: Recipe
rangeIncludes: Text

DaySpa
type: Class
comment: A day spa.
subclass of: HealthAndBeautyBusiness

OccupationalActivity
type: PhysicalActivityCategory
isPartOf: health-lifesci.schema.org
comment: Any physical activity engaged in for job-related purposes. Examples may include waiting tables, maid service, carrying a mailbag, picking fruits or vegetables, construction work, etc.

costPerUnit
type: Property
rangeIncludes: Text
rangeIncludes: QualitativeValue
rangeIncludes: Number
isPartOf: health-lifesci.schema.org
domainIncludes: DrugCost
comment: The cost per unit of the drug.

vehicleInteriorType
type: Property
contributor: Automotive Ontology Working Group
rangeIncludes: Text
domainIncludes: Vehicle
comment: The type or material of the interior of the vehicle (e.g. synthetic fabric, leather, wood, etc.). While most interior types are characterized by the material used, an interior type can also be based on vehicle usage or target audience.

incentivizedItem
type: Property
isPartOf: pending.schema.org
source: https://github.com/schemaorg/schemaorg/issues/3572
rangeIncludes: DefinedTerm
rangeIncludes: Product
comment: The type or specific product(s) and/or service(s) being incentivized. DefinedTermSets are used for product and service categories such as the United Nations Standard Products and Services Code: { "@type": "DefinedTerm", "inDefinedTermSet": "https://www.unspsc.org/", "termCode": "261315XX", "name": "Photovoltaic module" } For a specific product or service, use the Product type: { "@type": "Product", "name": "Kenmore White 17" Microwave", } For multiple different incentivized items, use multiple DefinedTerm or Product.
domainIncludes: FinancialIncentive

mealService
type: Property
domainIncludes: Flight
rangeIncludes: Text
comment: Description of the meals that will be provided or available for purchase.

WPAdBlock
type: Class
comment: An advertising section of the page.
subclass of: WebPageElement

productGroupID
type: Property
rangeIncludes: Text
isPartOf: pending.schema.org
comment: Indicates a textual identifier for a ProductGroup.
source: https://github.com/schemaorg/schemaorg/issues/1797
domainIncludes: ProductGroup

Nose
type: PhysicalExam
isPartOf: health-lifesci.schema.org
comment: Nose function assessment with clinical examination.

warrantyPromise
type: Property
supersededBy: warranty
comment: The warranty promise(s) included in the offer.
domainIncludes: BuyAction
domainIncludes: SellAction
rangeIncludes: WarrantyPromise

warranty
type: Property
domainIncludes: Demand
domainIncludes: Offer
comment: The warranty promise(s) included in the offer.
rangeIncludes: WarrantyPromise
contributor: GoodRelationsTerms

requiredGender
type: Property
comment: Audiences defined by a person's gender.
rangeIncludes: Text
domainIncludes: PeopleAudience

broadcastDisplayName
type: Property
domainIncludes: BroadcastService
rangeIncludes: Text
comment: The name displayed in the channel guide. For many US affiliates, it is the network name.

isSimilarTo
type: Property
rangeIncludes: Service
rangeIncludes: Product
contributor: GoodRelationsTerms
equivalent property: SubstituteProduct
comment: A pointer to another, functionally similar product (or multiple products).
domainIncludes: Product
domainIncludes: Service

returnLabelSource
type: Property
rangeIncludes: ReturnLabelSourceEnumeration
domainIncludes: MerchantReturnPolicy
isPartOf: pending.schema.org
source: https://github.com/schemaorg/schemaorg/issues/2880
comment: The method (from an enumeration) by which the customer obtains a return shipping label for a product returned for any reason.

netWorth
type: Property
rangeIncludes: PriceSpecification
rangeIncludes: MonetaryAmount
domainIncludes: Person
comment: The total financial value of the person as calculated by subtracting the total value of liabilities from the total value of assets.

medicalSpecialty
type: Property
isPartOf: health-lifesci.schema.org
domainIncludes: Physician
domainIncludes: MedicalClinic
domainIncludes: MedicalOrganization
domainIncludes: Hospital
comment: A medical specialty of the provider.
rangeIncludes: MedicalSpecialty

doseValue
type: Property
rangeIncludes: Number
rangeIncludes: QualitativeValue
comment: The value of the dose, e.g. 500.
domainIncludes: DoseSchedule
isPartOf: health-lifesci.schema.org

coverageEndTime
type: Property
rangeIncludes: DateTime
domainIncludes: LiveBlogPosting
comment: The time when the live blog will stop covering the Event. Note that coverage may continue after the Event concludes.

BeautySalon
type: Class
subclass of: HealthAndBeautyBusiness
comment: Beauty salon.

BuddhistTemple
type: Class
comment: A Buddhist temple.
subclass of: PlaceOfWorship

appearance
type: Property
source: https://github.com/schemaorg/schemaorg/issues/1828
comment: Indicates an occurrence of a Claim in some CreativeWork.
sub property of: workExample
domainIncludes: Claim
isPartOf: pending.schema.org
rangeIncludes: CreativeWork

FrontWheelDriveConfiguration
type: DriveWheelConfigurationValue
comment: Front-wheel drive is a transmission layout where the engine drives the front wheels.
contributor: Automotive Ontology Working Group

bookingTime
type: Property
rangeIncludes: DateTime
comment: The date and time the reservation was booked.
domainIncludes: Reservation

CheckInAdvance
type: PaymentMethodType
comment: Payment in advance by sending a check, equivalent to http://purl.org/goodrelations/v1#CheckInAdvance.

CatholicChurch
type: Class
comment: A Catholic church.
subclass of: Church

Otolaryngologic
type: MedicalSpecialty
comment: A specific branch of medical science that is concerned with the ear, nose and throat and their respective disease states.
isPartOf: health-lifesci.schema.org
subclass of: MedicalBusiness

AssignAction
type: Class
comment: The act of allocating an action/event/task to some destination (someone or something).
subclass of: AllocateAction

OnDemandEvent
type: Class
comment: A publication event, e.g. catch-up TV or radio podcast, during which a program is available on-demand.
subclass of: PublicationEvent

HealthCare
type: GovernmentBenefitsType
isPartOf: pending.schema.org
source: https://github.com/schemaorg/schemaorg/issues/2534
comment: HealthCare: this is a benefit for health care.

proficiencyLevel
type: Property
comment: Proficiency needed for this content; expected values: 'Beginner', 'Expert'.
domainIncludes: TechArticle
rangeIncludes: Text

Discontinued
type: ItemAvailability
comment: Indicates that the item has been discontinued.

healthPlanMarketingUrl
type: Property
comment: The URL that goes directly to the plan brochure for the specific standard plan or plan variation.
isPartOf: pending.schema.org
source: https://github.com/schemaorg/schemaorg/issues/1062
rangeIncludes: URL
domainIncludes: HealthInsurancePlan

estimatedCost
type: Property
domainIncludes: HowTo
domainIncludes: HowToSupply
rangeIncludes: MonetaryAmount
rangeIncludes: Text
comment: The estimated cost of the supply or supplies consumed when performing instructions.

colorist
type: Property
comment: The individual who adds color to inked drawings.
domainIncludes: ComicStory
domainIncludes: VisualArtwork
domainIncludes: ComicIssue
rangeIncludes: Person
isPartOf: bib.schema.org

OnlineOnly
type: ItemAvailability
comment: Indicates that the item is available only online.

jobTitle
type: Property
isPartOf: pending.schema.org
domainIncludes: Person
rangeIncludes: DefinedTerm
rangeIncludes: Text
comment: The job title of the person (for example, Financial Manager).
source: https://github.com/schemaorg/schemaorg/issues/2192

recipeCategory
type: Property
domainIncludes: Recipe
comment: The category of the recipe—for example, appetizer, entree, etc.
rangeIncludes: Text

cholesterolContent
type: Property
comment: The number of milligrams of cholesterol.
rangeIncludes: Mass
domainIncludes: NutritionInformation

seasons
type: Property
domainIncludes: VideoGameSeries
domainIncludes: TVSeries
domainIncludes: RadioSeries
supersededBy: season
comment: A season in a media series.
rangeIncludes: CreativeWorkSeason

season
type: Property
rangeIncludes: CreativeWorkSeason
rangeIncludes: URL
sub property of: hasPart
domainIncludes: TVSeries
domainIncludes: RadioSeries
domainIncludes: VideoGameSeries
comment: A season in a media series.
supersededBy: containsSeason

nationality
type: Property
domainIncludes: Person
comment: Nationality of the person.
rangeIncludes: Country

customerRemorseReturnShippingFeesAmount
type: Property
rangeIncludes: MonetaryAmount
comment: The amount of shipping costs if a product is returned due to customer remorse. Applicable when property customerRemorseReturnFees equals ReturnShippingFees.
isPartOf: pending.schema.org
domainIncludes: MerchantReturnPolicy
source: https://github.com/schemaorg/schemaorg/issues/2880

numberOfEpisodes
type: Property
rangeIncludes: Integer
domainIncludes: CreativeWorkSeason
domainIncludes: RadioSeries
domainIncludes: TVSeries
domainIncludes: VideoGameSeries
comment: The number of episodes in this season or series.

relevantSpecialty
type: Property
domainIncludes: MedicalEntity
rangeIncludes: MedicalSpecialty
isPartOf: health-lifesci.schema.org
comment: If applicable, a medical specialty in which this entity is relevant.

HighSchool
type: Class
comment: A high school.
subclass of: EducationalOrganization

PercutaneousProcedure
type: MedicalProcedureType
comment: A type of medical procedure that involves percutaneous techniques, where access to organs or tissue is achieved via needle-puncture of the skin. For example, catheter-based procedures like stent delivery.
isPartOf: health-lifesci.schema.org

fileSize
type: Property
comment: Size of the application / package (e.g. 18MB). In the absence of a unit (MB, KB etc.), KB will be assumed.
domainIncludes: SoftwareApplication
rangeIncludes: Text

collection
type: Property
rangeIncludes: Thing
comment: A sub property of object. The collection target of the action.
domainIncludes: UpdateAction
sub property of: object
supersededBy: targetCollection

targetCollection
type: Property
rangeIncludes: Thing
comment: A sub property of object. The collection target of the action.
domainIncludes: UpdateAction
sub property of: object

monoisotopicMolecularWeight
type: Property
domainIncludes: MolecularEntity
rangeIncludes: QuantitativeValue
rangeIncludes: Text
isPartOf: pending.schema.org
source: MolecularEntity
comment: The monoisotopic mass is the sum of the masses of the atoms in a molecule using the unbound, ground-state, rest mass of the principal (most abundant) isotope for each element instead of the isotopic average mass. Please include the units in the form '<Number> <unit>', for example '770.230488 g/mol' or as '<QuantitativeValue>.

studyLocation
type: Property
rangeIncludes: AdministrativeArea
comment: The location in which the study is taking/took place.
isPartOf: health-lifesci.schema.org
domainIncludes: MedicalStudy

certificationIdentification
type: Property
sub property of: hasRegistrationIdentifier
source: https://github.com/schemaorg/schemaorg/issues/3230
rangeIncludes: DefinedTerm
rangeIncludes: Text
isPartOf: pending.schema.org
equivalent property: CertificateIdentifier
comment: Identifier of a certification instance (as registered with an independent certification body). Typically this identifier can be used to consult and verify the certification instance. See also [gs1:certificationIdentification](https://www.gs1.org/voc/certificationIdentification).
domainIncludes: Certification

deliveryLeadTime
type: Property
contributor: GoodRelationsTerms
rangeIncludes: QuantitativeValue
comment: The typical delay between the receipt of the order and the goods either leaving the warehouse or being prepared for pickup, in case the delivery method is on site pickup.
domainIncludes: Demand
domainIncludes: Offer

musicReleaseFormat
type: Property
contributor: MBZ
rangeIncludes: MusicReleaseFormatType
comment: Format of this release (the type of recording media used, i.e. compact disc, digital media, LP, etc.).
domainIncludes: MusicRelease

availableTest
type: Property
rangeIncludes: MedicalTest
domainIncludes: DiagnosticLab
comment: A diagnostic test or procedure offered by this lab.
isPartOf: health-lifesci.schema.org

departurePlatform
type: Property
domainIncludes: TrainTrip
comment: The platform from which the train departs.
rangeIncludes: Text

includedDataCatalog
type: Property
comment: A data catalog which contains this dataset (this property was previously 'catalog', preferred name is now 'includedInDataCatalog').
domainIncludes: Dataset
supersededBy: includedInDataCatalog
rangeIncludes: DataCatalog

name
type: Property
domainIncludes: Thing
rangeIncludes: Text
equivalent property: title
equivalent property: hasName
comment: The name of the item.
sub property of: label

drugUnit
type: Property
isPartOf: health-lifesci.schema.org
domainIncludes: DrugCost
domainIncludes: Drug
rangeIncludes: Text
comment: The unit in which the drug is measured, e.g. '5 mg tablet'.

DigitalFormat
type: MusicReleaseFormatType
comment: DigitalFormat.
contributor: MBZ

actionProcess
type: Property
comment: Description of the process by which the action was performed.
domainIncludes: Action
rangeIncludes: HowTo

orderDelivery
type: Property
comment: The delivery of the parcel related to this order or order item.
rangeIncludes: ParcelDelivery
domainIncludes: OrderItem
domainIncludes: Order

cvdNumTotBeds
type: Property
domainIncludes: CDCPMDRecord
isPartOf: pending.schema.org
comment: numtotbeds - ALL HOSPITAL BEDS: Total number of all inpatient and outpatient beds, including all staffed, ICU, licensed, and overflow (surge) beds used for inpatients or outpatients.
source: https://github.com/schemaorg/schemaorg/issues/2521
rangeIncludes: Number

measuredProperty
type: Property
isPartOf: pending.schema.org
comment: The measuredProperty of an Observation, typically via its StatisticalVariable. There are various kinds of applicable Property: a schema.org property, a property from other RDF-compatible systems, e.g. W3C RDF Data Cube, Data Commons, Wikidata, or schema.org extensions such as [GS1's](https://www.gs1.org/voc/?show=properties).
source: https://github.com/schemaorg/schemaorg/issues/2291
rangeIncludes: Property
domainIncludes: Observation
domainIncludes: StatisticalVariable

Pathology
type: MedicalSpecialty
comment: A specific branch of medical science that is concerned with the study of the cause, origin and nature of a disease state, including its consequences as a result of manifestation of the disease. In clinical care, the term is used to designate a branch of medicine using laboratory tests to diagnose and determine the prognostic significance of illness.
isPartOf: health-lifesci.schema.org

median
type: Property
rangeIncludes: Number
domainIncludes: QuantitativeValueDistribution
comment: The median value.
source: https://github.com/schemaorg/schemaorg/issues/1698

WearableSizeGroupMisses
type: WearableSizeGroupEnumeration
comment: Size group "Misses" (also known as "Missy") for wearables.
isPartOf: pending.schema.org
source: https://github.com/schemaorg/schemaorg/issues/2811

TollFree
type: ContactPointOption
comment: The associated telephone number is toll free.

contributor
type: Property
comment: A secondary contributor to the CreativeWork or Event.
domainIncludes: Event
domainIncludes: CreativeWork
rangeIncludes: Person
rangeIncludes: Organization

occupationLocation
type: Property
rangeIncludes: AdministrativeArea
source: https://github.com/schemaorg/schemaorg/issues/1698
domainIncludes: Occupation
comment: The region/country for which this occupational description is appropriate. Note that educational requirements and qualifications can vary between jurisdictions.

pickupLocation
type: Property
domainIncludes: RentalCarReservation
domainIncludes: TaxiReservation
rangeIncludes: Place
comment: Where a taxi will pick up a passenger or a rental car can be picked up.

procedure
type: Property
isPartOf: health-lifesci.schema.org
comment: A description of the procedure involved in setting up, using, and/or installing the device.
rangeIncludes: Text
domainIncludes: MedicalDevice

measurementQualifier
type: Property
rangeIncludes: Enumeration
domainIncludes: Observation
domainIncludes: StatisticalVariable
isPartOf: pending.schema.org
comment: Provides additional qualification to an observation. For example, a GDP observation measures the Nominal value.
source: https://github.com/schemaorg/schemaorg/issues/2564

OnlineEventAttendanceMode
type: EventAttendanceModeEnumeration
comment: OnlineEventAttendanceMode - an event that is primarily conducted online.
source: https://github.com/schemaorg/schemaorg/issues/1842
isPartOf: pending.schema.org

WearableSizeSystemGS1
type: WearableSizeSystemEnumeration
isPartOf: pending.schema.org
comment: GS1 (formerly NRF) size system for wearables.
source: https://github.com/schemaorg/schemaorg/issues/2811

ratingValue
type: Property
domainIncludes: Rating
rangeIncludes: Number
rangeIncludes: Text
comment: The rating for the content.\n\nUsage guidelines:\n\n* Use values from 0123456789 (Unicode 'DIGIT ZERO' (U+0030) to 'DIGIT NINE' (U+0039)) rather than superficially similar Unicode symbols.\n* Use '.' (Unicode 'FULL STOP' (U+002E)) rather than ',' to indicate a decimal point. Avoid using these symbols as a readability separator.

subStructure
type: Property
domainIncludes: AnatomicalStructure
comment: Component (sub-)structure(s) that comprise this anatomical structure.
rangeIncludes: AnatomicalStructure
isPartOf: health-lifesci.schema.org

Bacteria
type: InfectiousAgentClass
isPartOf: health-lifesci.schema.org
comment: Pathogenic bacteria that cause bacterial infection.

aspect
type: Property
supersededBy: mainContentOfPage
comment: An aspect of medical practice that is considered on the page, such as 'diagnosis', 'treatment', 'causes', 'prognosis', 'etiology', 'epidemiology', etc.
isPartOf: health-lifesci.schema.org
domainIncludes: MedicalWebPage
rangeIncludes: Text

mainContentOfPage
type: Property
domainIncludes: WebPage
rangeIncludes: WebPageElement
comment: Indicates if this web page element is the main subject of the page.

RsvpResponseYes
type: RsvpResponseType
comment: The invitee will attend.

PhotographAction
type: Class
subclass of: CreateAction
comment: The act of capturing still images of objects using a camera.

preparation
type: Property
domainIncludes: MedicalProcedure
rangeIncludes: Text
rangeIncludes: MedicalEntity
isPartOf: health-lifesci.schema.org
comment: Typical preparation that a patient must undergo before having the procedure performed.

Nonprofit501q
type: USNonprofitType
isPartOf: pending.schema.org
source: https://github.com/schemaorg/schemaorg/issues/2543
comment: Nonprofit501q: Non-profit type referring to Credit Counseling Organizations.

busName
type: Property
rangeIncludes: Text
comment: The name of the bus (e.g. Bolt Express).
domainIncludes: BusTrip

priceType
type: Property
rangeIncludes: Text
rangeIncludes: PriceTypeEnumeration
equivalent property: PriceTypeCode
domainIncludes: CompoundPriceSpecification
domainIncludes: UnitPriceSpecification
comment: Defines the type of a price specified for an offered product, for example a list price, a (temporary) sale price or a manufacturer suggested retail price. If multiple prices are specified for an offer the priceType property can be used to identify the type of each such specified price. The value of priceType can be specified as a value from enumeration PriceTypeEnumeration or, a UN/EDIFACT 5387 code, or as a free form text string for price types that are not already predefined in PriceTypeEnumeration.
contributor: GoodRelationsTerms
sub property of: isClassifiedBy

geo
type: Property
domainIncludes: Place
comment: The geo coordinates of the place.
rangeIncludes: GeoShape
rangeIncludes: GeoCoordinates

thumbnailUrl
type: Property
comment: A thumbnail image relevant to the Thing.
domainIncludes: CreativeWork
rangeIncludes: URL

resultReview
type: Property
domainIncludes: ReviewAction
comment: A sub property of result. The review that resulted in the performing of the action.
rangeIncludes: Review
sub property of: result

Barcode
type: Class
comment: An image of a visual machine-readable code such as a barcode or QR code.
subclass of: ImageObject

TravelAgency
type: Class
subclass of: LocalBusiness
comment: A travel agency.

coverageStartTime
type: Property
rangeIncludes: DateTime
comment: The time when the live blog will begin covering the Event. Note that coverage may begin before the Event's start time. The LiveBlogPosting may also be created before coverage begins.
domainIncludes: LiveBlogPosting

significance
type: Property
domainIncludes: SuperficialAnatomy
isPartOf: health-lifesci.schema.org
comment: The significance associated with the superficial anatomy; as an example, how characteristics of the superficial anatomy can suggest underlying medical conditions or courses of treatment.
rangeIncludes: Text

numberOfBeds
type: Property
comment: The quantity of the given bed type available in the HotelRoom, Suite, House, or Apartment.
domainIncludes: BedDetails
rangeIncludes: Number
contributor: STI Accommodation Ontology

ActivateAction
type: Class
subclass of: ControlAction
comment: The act of starting or activating a device or application (e.g. starting a timer or turning on a flashlight).

LockerDelivery
type: DeliveryMethod
comment: A DeliveryMethod in which an item is made available via locker.

nonEqual
type: Property
domainIncludes: QualitativeValue
rangeIncludes: QualitativeValue
comment: This ordering relation for qualitative values indicates that the subject is not equal to the object.
contributor: GoodRelationsTerms

programType
type: Property
comment: The type of educational or occupational program. For example, classroom, internship, alternance, etc.
domainIncludes: EducationalOccupationalProgram
rangeIncludes: Text
rangeIncludes: DefinedTerm
isPartOf: pending.schema.org
source: https://github.com/schemaorg/schemaorg/issues/2460

pregnancyWarning
type: Property
rangeIncludes: Text
domainIncludes: Drug
comment: Any precaution, guidance, contraindication, etc. related to this drug's use during pregnancy.
isPartOf: health-lifesci.schema.org

DigitalCaptureDigitalSource
type: IPTCDigitalSourceEnumeration
source: https://github.com/schemaorg/schemaorg/issues/3392
comment: Content coded as 'digital capture' using the IPTC digital source type vocabulary.
isPartOf: pending.schema.org

isAccessoryOrSparePartFor
type: Property
comment: A pointer to another product (or multiple products) for which this product is an accessory or spare part.
rangeIncludes: Product
domainIncludes: Product
contributor: GoodRelationsTerms

WearableMeasurementLength
type: WearableMeasurementTypeEnumeration
source: https://github.com/schemaorg/schemaorg/issues/2811
comment: Represents the length, for example of a dress.
isPartOf: pending.schema.org

tickerSymbol
type: Property
rangeIncludes: Text
domainIncludes: Corporation
comment: The exchange traded instrument associated with a Corporation object. The tickerSymbol is expressed as an exchange and an instrument name separated by a space character. For the exchange component of the tickerSymbol attribute, we recommend using the controlled vocabulary of Market Identifier Codes (MIC) specified in ISO 15022.

ccRecipient
type: Property
comment: A sub property of recipient. The recipient copied on a message.
domainIncludes: Message
rangeIncludes: ContactPoint
rangeIncludes: Organization
rangeIncludes: Person
sub property of: recipient

schemaVersion
type: Property
rangeIncludes: Text
rangeIncludes: URL
domainIncludes: CreativeWork
comment: Indicates (by URL or string) a particular version of a schema used in some CreativeWork. This property was created primarily to indicate the use of a specific schema.org release, e.g. ```10.0``` as a simple string, or more explicitly via URL, ```http://schema.org/docs/releases.html#v10.0```. There may be situations in which other schemas might usefully be referenced this way, e.g. ```http://dublincore.org/specifications/dublin-core/dces/1999-07-02/``` but this has not been carefully explored in the community.

givenName
type: Property
comment: Given name. In the U.S., the first name of a Person.
domainIncludes: Person
rangeIncludes: Text

gameAvailabilityType
type: Property
comment: Indicates the availability type of the game content associated with this action, such as whether it is a full version or a demo.
rangeIncludes: Text
rangeIncludes: GameAvailabilityEnumeration
isPartOf: pending.schema.org
source: https://github.com/schemaorg/schemaorg/issues/3058
domainIncludes: PlayGameAction

Nonprofit501c21
type: USNonprofitType
isPartOf: pending.schema.org
source: https://github.com/schemaorg/schemaorg/issues/2543
comment: Nonprofit501c21: Non-profit type referring to Black Lung Benefit Trusts.

GasStation
type: Class
comment: A gas station.
subclass of: AutomotiveBusiness

PurchaseTypeUsedPurchase
type: PurchaseType
comment: This is a purchase of a used item.
isPartOf: pending.schema.org
source: https://github.com/schemaorg/schemaorg/issues/3572

Tuesday
type: DayOfWeek
comment: The day of the week between Monday and Wednesday.

missionCoveragePrioritiesPolicy
type: Property
rangeIncludes: CreativeWork
rangeIncludes: URL
source: https://github.com/schemaorg/schemaorg/issues/1525
contributor: TP
domainIncludes: NewsMediaOrganization
comment: For a NewsMediaOrganization, a statement on coverage priorities, including any public agenda or stance on issues.
sub property of: publishingPrinciples
isPartOf: pending.schema.org

NailSalon
type: Class
comment: A nail salon.
subclass of: HealthAndBeautyBusiness

LowFatDiet
type: RestrictedDiet
comment: A diet focused on reduced fat and cholesterol intake.

conditionsOfAccess
type: Property
isPartOf: pending.schema.org
domainIncludes: CreativeWork
rangeIncludes: Text
source: https://github.com/schemaorg/schemaorg/issues/2173
comment: Conditions that affect the availability of, or method(s) of access to, an item. Typically used for real world items such as an ArchiveComponent held by an ArchiveOrganization. This property is not suitable for use as a general Web access control mechanism. It is expressed only in natural language.\n\nFor example "Available by appointment from the Reading Room" or "Accessible only from logged-in accounts ".

WearableSizeSystemUS
type: WearableSizeSystemEnumeration
isPartOf: pending.schema.org
source: https://github.com/schemaorg/schemaorg/issues/2811
comment: United States size system for wearables.

flightNumber
type: Property
domainIncludes: Flight
rangeIncludes: Text
comment: The unique identifier for a flight including the airline IATA code. For example, if describing United flight 110, where the IATA code for United is 'UA', the flightNumber is 'UA110'.
sub property of: identifier

FullGameAvailability
type: GameAvailabilityEnumeration
source: https://github.com/schemaorg/schemaorg/issues/3058
comment: Indicates full game availability.
isPartOf: pending.schema.org

Nonprofit501c9
type: USNonprofitType
source: https://github.com/schemaorg/schemaorg/issues/2543
comment: Nonprofit501c9: Non-profit type referring to Voluntary Employee Beneficiary Associations.
isPartOf: pending.schema.org

RearWheelDriveConfiguration
type: DriveWheelConfigurationValue
comment: Real-wheel drive is a transmission layout where the engine drives the rear wheels.
contributor: Automotive Ontology Working Group

EBook
type: BookFormatType
comment: Book format: Ebook.

PatientExperienceHealthAspect
type: HealthAspectEnumeration
isPartOf: pending.schema.org
source: https://github.com/schemaorg/schemaorg/issues/2374
comment: Content about the real life experience of patients or people that have lived a similar experience about the topic. May be forums, topics, Q-and-A and related material.

ShoppingCenter
type: Class
subclass of: LocalBusiness
comment: A shopping center or mall.

timestamp
type: Property
rangeIncludes: DateTime
source: https://github.com/schemaorg/schemaorg/issues/4527
isPartOf: pending.schema.org
equivalent class: atTime
comment: The instant the event occured.
domainIncludes: InstantaneousEvent

musicArrangement
type: Property
domainIncludes: MusicComposition
rangeIncludes: MusicComposition
contributor: MBZ
comment: An arrangement derived from the composition.

monthsOfExperience
type: Property
isPartOf: pending.schema.org
source: https://github.com/schemaorg/schemaorg/issues/2681
comment: Indicates the minimal number of months of experience required for a position.
rangeIncludes: Number
domainIncludes: OccupationalExperienceRequirements

namedPosition
type: Property
supersededBy: roleName
domainIncludes: Role
rangeIncludes: URL
rangeIncludes: Text
comment: A position played, performed or filled by a person or organization, as part of an organization. For example, an athlete in a SportsTeam might play in the position named 'Quarterback'.

roleName
type: Property
comment: A role played, performed or filled by a person or organization. For example, the team of creators for a comic book might fill the roles named 'inker', 'penciller', and 'letterer'; or an athlete in a SportsTeam might play in the position named 'Quarterback'.
rangeIncludes: URL
rangeIncludes: Text
domainIncludes: Role

EditedOrCroppedContent
type: MediaManipulationRatingEnumeration
comment: Content coded 'edited or cropped content' in a MediaReview, considered in the context of how it was published or shared. For a VideoObject to be 'edited or cropped content': The video has been edited or rearranged. This category applies to time edits, including editing multiple videos together to alter the story being told or editing out large portions from a video. For an ImageObject to be 'edited or cropped content': Presenting a part of an image from a larger whole to mislead the viewer. For an ImageObject with embedded text to be 'edited or cropped content': Presenting a part of an image from a larger whole to mislead the viewer. For an AudioObject to be 'edited or cropped content': The audio has been edited or rearranged. This category applies to time edits, including editing multiple audio clips together to alter the story being told or editing out large portions from the recording.
source: https://github.com/schemaorg/schemaorg/issues/2450
isPartOf: pending.schema.org

EvidenceLevelA
type: MedicalEvidenceLevel
comment: Data derived from multiple randomized clinical trials or meta-analyses.
isPartOf: health-lifesci.schema.org

stageAsNumber
type: Property
domainIncludes: MedicalConditionStage
isPartOf: health-lifesci.schema.org
comment: The stage represented as a number, e.g. 3.
rangeIncludes: Number

SearchResultsPage
type: Class
subclass of: WebPage
comment: Web page type: Search results page.

creditedTo
type: Property
rangeIncludes: Person
rangeIncludes: Organization
domainIncludes: MusicRelease
contributor: MBZ
comment: The group the release is credited to if different than the byArtist. For example, Red and Blue is credited to "Stefani Germanotta Band", but by Lady Gaga.

numberOfDoors
type: Property
rangeIncludes: QuantitativeValue
rangeIncludes: Number
comment: The number of doors.\n\nTypical unit code(s): C62.
contributor: Automotive Ontology Working Group
domainIncludes: Vehicle

Emergency
type: MedicalSpecialty
isPartOf: health-lifesci.schema.org
subclass of: MedicalBusiness
comment: A specific branch of medical science that deals with the evaluation and initial treatment of medical conditions caused by trauma or sudden illness.

FreeReturn
type: ReturnFeesEnumeration
isPartOf: pending.schema.org
source: https://github.com/schemaorg/schemaorg/issues/2880
comment: Specifies that product returns are free of charge for the customer.

Nonprofit501c27
type: USNonprofitType
isPartOf: pending.schema.org
source: https://github.com/schemaorg/schemaorg/issues/2543
comment: Nonprofit501c27: Non-profit type referring to State-Sponsored Workers' Compensation Reinsurance Organizations.

BowlingAlley
type: Class
subclass of: SportsActivityLocation
comment: A bowling alley.

numberOfPlayers
type: Property
rangeIncludes: QuantitativeValue
comment: Indicate how many people can play this game (minimum, maximum, or range).
domainIncludes: Game
domainIncludes: VideoGameSeries

DrawAction
type: Class
subclass of: CreateAction
comment: The act of producing a visual/graphical representation of an object, typically with a pen/pencil and paper as instruments.

lowPrice
type: Property
rangeIncludes: Text
rangeIncludes: Number
comment: The lowest price of all offers available.\n\nUsage guidelines:\n\n* Use values from 0123456789 (Unicode 'DIGIT ZERO' (U+0030) to 'DIGIT NINE' (U+0039)) rather than superficially similar Unicode symbols.\n* Use '.' (Unicode 'FULL STOP' (U+002E)) rather than ',' to indicate a decimal point. Avoid using these symbols as a readability separator.
domainIncludes: AggregateOffer
sub property of: hasLowerBound
sub property of: hasMonetaryAmount

mapType
type: Property
domainIncludes: Map
comment: Indicates the kind of Map, from the MapCategoryType Enumeration.
rangeIncludes: MapCategoryType

naturalProgression
type: Property
domainIncludes: MedicalCondition
isPartOf: health-lifesci.schema.org
comment: The expected progression of the condition if it is not treated and allowed to progress naturally.
rangeIncludes: Text

targetProduct
type: Property
comment: Target Operating System / Product to which the code applies. If applies to several versions, just the product name can be used.
domainIncludes: SoftwareSourceCode
rangeIncludes: SoftwareApplication

PaymentPastDue
type: PaymentStatusType
comment: The payment is due and considered late.

BrokerageAccount
type: Class
source: https://github.com/schemaorg/schemaorg/issues/1253
comment: An account that allows an investor to deposit funds and place investment orders with a licensed broker or brokerage firm.
subclass of: InvestmentOrDeposit
contributor: FIBO
isPartOf: pending.schema.org

relatedAnatomy
type: Property
rangeIncludes: AnatomicalStructure
rangeIncludes: AnatomicalSystem
comment: Anatomical systems or structures that relate to the superficial anatomy.
domainIncludes: SuperficialAnatomy
isPartOf: health-lifesci.schema.org

studyDesign
type: Property
domainIncludes: MedicalObservationalStudy
comment: Specifics about the observational study design (enumerated).
rangeIncludes: MedicalObservationalStudyDesign
isPartOf: health-lifesci.schema.org

RejectAction
type: Class
subclass of: AllocateAction
comment: The act of rejecting to/adopting an object.\n\nRelated actions:\n\n* AcceptAction: The antonym of RejectAction.

accessibilityAPI
type: Property
domainIncludes: CreativeWork
comment: Indicates that the resource is compatible with the referenced accessibility API. Values should be drawn from the [approved vocabulary](https://www.w3.org/2021/a11y-discov-vocab/latest/#accessibilityAPI-vocabulary).
rangeIncludes: Text

numberOfPages
type: Property
comment: The number of pages in the book.
domainIncludes: Book
rangeIncludes: Integer

publicTransportClosuresInfo
type: Property
source: https://github.com/schemaorg/schemaorg/issues/2490
comment: Information about public transport closures.
rangeIncludes: URL
rangeIncludes: WebContent
domainIncludes: SpecialAnnouncement
isPartOf: pending.schema.org

volumeNumber
type: Property
rangeIncludes: Text
rangeIncludes: Integer
contributor: bibex
comment: Identifies the volume of publication or multi-part work; for example, "iii" or "2".
equivalent property: volume
sub property of: position
domainIncludes: PublicationVolume

DisagreeAction
type: Class
subclass of: ReactAction
comment: The act of expressing a difference of opinion with the object. An agent disagrees to/about an object (a proposition, topic or theme) with participants.

gamePlatform
type: Property
domainIncludes: VideoGameSeries
domainIncludes: VideoGame
rangeIncludes: Text
rangeIncludes: Thing
rangeIncludes: URL
comment: The electronic systems used to play video games.

returnPolicyCategory
type: Property
rangeIncludes: MerchantReturnEnumeration
comment: Specifies an applicable return policy (from an enumeration).
isPartOf: pending.schema.org
domainIncludes: MerchantReturnPolicySeasonalOverride
domainIncludes: MerchantReturnPolicy
source: https://github.com/schemaorg/schemaorg/issues/2288

alignmentType
type: Property
rangeIncludes: Text
domainIncludes: AlignmentObject
comment: A category of alignment between the learning resource and the framework node. Recommended values include: 'requires', 'textComplexity', 'readingLevel', and 'educationalSubject'.

sodiumContent
type: Property
domainIncludes: NutritionInformation
rangeIncludes: Mass
comment: The number of milligrams of sodium.

CertificationActive
type: CertificationStatusEnumeration
comment: Specifies that a certification is active.
source: https://github.com/schemaorg/schemaorg/issues/3230
isPartOf: pending.schema.org

playMode
type: Property
rangeIncludes: GamePlayMode
domainIncludes: VideoGameSeries
domainIncludes: VideoGame
comment: Indicates whether this game is multi-player, co-op or single-player. The game can be marked as multi-player, co-op and single-player at the same time.

loanTerm
type: Property
contributor: FIBO
sub property of: duration
comment: The duration of the loan or credit agreement.
rangeIncludes: QuantitativeValue
domainIncludes: LoanOrCredit

costCurrency
type: Property
rangeIncludes: Text
comment: The currency (in 3-letter) of the drug cost. See: http://en.wikipedia.org/wiki/ISO_4217.
isPartOf: health-lifesci.schema.org
domainIncludes: DrugCost

estimatesRiskOf
type: Property
domainIncludes: MedicalRiskEstimator
comment: The condition, complication, or symptom whose risk is being estimated.
isPartOf: health-lifesci.schema.org
rangeIncludes: MedicalEntity

cvdNumVentUse
type: Property
source: https://github.com/schemaorg/schemaorg/issues/2521
rangeIncludes: Number
isPartOf: pending.schema.org
domainIncludes: CDCPMDRecord
comment: numventuse - MECHANICAL VENTILATORS IN USE: Total number of ventilators in use.

WearableSizeGroupRegular
type: WearableSizeGroupEnumeration
isPartOf: pending.schema.org
comment: Size group "Regular" for wearables.
source: https://github.com/schemaorg/schemaorg/issues/2811

abridged
type: Property
isPartOf: bib.schema.org
comment: Indicates whether the book is an abridged edition.
rangeIncludes: Boolean
domainIncludes: Book

appliesToPaymentMethod
type: Property
comment: The payment method(s) to which the payment charge specification applies.
contributor: GoodRelationsTerms
domainIncludes: PaymentChargeSpecification
rangeIncludes: PaymentMethod

Pulmonary
type: MedicalSpecialty
isPartOf: health-lifesci.schema.org
comment: A specific branch of medical science that pertains to the study of the respiratory system and its respective disease states.

sportsEvent
type: Property
rangeIncludes: SportsEvent
domainIncludes: ExerciseAction
comment: A sub property of location. The sports event where this action occurred.
sub property of: location

cheatCode
type: Property
domainIncludes: VideoGame
domainIncludes: VideoGameSeries
rangeIncludes: CreativeWork
comment: Cheat codes to the game.

companyRegistration
type: Property
rangeIncludes: Certification
comment: The official registration number of a business including the organization that issued it such as Company House or Chamber of Commerce.
domainIncludes: Organization

FDAcategoryA
type: DrugPregnancyCategory
isPartOf: health-lifesci.schema.org
comment: A designation by the US FDA signifying that adequate and well-controlled studies have failed to demonstrate a risk to the fetus in the first trimester of pregnancy (and there is no evidence of risk in later trimesters).

speechToTextMarkup
type: Property
rangeIncludes: Text
source: https://github.com/schemaorg/schemaorg/issues/2108
isPartOf: pending.schema.org
domainIncludes: PronounceableText
comment: Form of markup used. eg. [SSML](https://www.w3.org/TR/speech-synthesis11) or [IPA](https://www.wikidata.org/wiki/Property:P898).

ParentalSupport
type: GovernmentBenefitsType
source: https://github.com/schemaorg/schemaorg/issues/2534
comment: ParentalSupport: this is a benefit for parental support.
isPartOf: pending.schema.org

WearableMeasurementCup
type: WearableMeasurementTypeEnumeration
comment: Measurement of the cup, for example of a bra.
isPartOf: pending.schema.org
source: https://github.com/schemaorg/schemaorg/issues/2811

carrierRequirements
type: Property
comment: Specifies specific carrier(s) requirements for the application (e.g. an application may only work on a specific carrier network).
domainIncludes: MobileApplication
rangeIncludes: Text

mileageFromOdometer
type: Property
comment: The total distance travelled by the particular vehicle since its initial production, as read from its odometer.\n\nTypical unit code(s): KMT for kilometers, SMI for statute miles.
rangeIncludes: QuantitativeValue
contributor: Automotive Ontology Working Group
domainIncludes: Vehicle

offersPrescriptionByMail
type: Property
comment: Whether prescriptions can be delivered by mail.
isPartOf: pending.schema.org
domainIncludes: HealthPlanFormulary
source: https://github.com/schemaorg/schemaorg/issues/1062
rangeIncludes: Boolean

transFatContent
type: Property
comment: The number of grams of trans fat.
domainIncludes: NutritionInformation
rangeIncludes: Mass

Ligament
type: Class
subclass of: AnatomicalStructure
isPartOf: health-lifesci.schema.org
comment: A short band of tough, flexible, fibrous connective tissue that functions to connect multiple bones, cartilages, and structurally support joints.

Psychiatric
type: MedicalSpecialty
comment: A specific branch of medical science that is concerned with the study, treatment, and prevention of mental illness, using both medical and psychological therapies.
isPartOf: health-lifesci.schema.org
subclass of: MedicalBusiness

Neurologic
type: MedicalSpecialty
comment: A specific branch of medical science that studies the nerves and nervous system and its respective disease states.
isPartOf: health-lifesci.schema.org

printSection
type: Property
comment: If this NewsArticle appears in print, this field indicates the print section in which the article appeared.
domainIncludes: NewsArticle
rangeIncludes: Text

expectedArrivalFrom
type: Property
domainIncludes: ParcelDelivery
rangeIncludes: DateTime
rangeIncludes: Date
comment: The earliest date the package may arrive.

error
type: Property
comment: For failed actions, more information on the cause of the failure. Consider using the Error type.
rangeIncludes: Thing
domainIncludes: Action

AutoPartsStore
type: Class
comment: An auto parts store.
subclass of: Store
subclass of: AutomotiveBusiness

petsAllowed
type: Property
rangeIncludes: Boolean
rangeIncludes: Text
domainIncludes: LodgingBusiness
domainIncludes: Accommodation
domainIncludes: FloorPlan
domainIncludes: ApartmentComplex
contributor: STI Accommodation Ontology
comment: Indicates whether pets are allowed to enter the accommodation or lodging business. More detailed information can be put in a text value.

addressLocality
type: Property
domainIncludes: PostalAddress
equivalent property: hasMunicipality
equivalent property: addressLocality
comment: The locality in which the street address is, and which is in the region. For example, Mountain View.
rangeIncludes: Text

sensoryRequirement
type: Property
isPartOf: pending.schema.org
rangeIncludes: DefinedTerm
rangeIncludes: URL
rangeIncludes: Text
domainIncludes: JobPosting
source: https://github.com/schemaorg/schemaorg/issues/2384
comment: A description of any sensory requirements and levels necessary to function on the job, including hearing and vision. Defined terms such as those in O*net may be used, but note that there is no way to specify the level of ability as well as its nature when using a defined term.

copyrightHolder
type: Property
domainIncludes: CreativeWork
comment: The party holding the legal copyright to the CreativeWork.
rangeIncludes: Person
rangeIncludes: Organization

exchangeRateSpread
type: Property
contributor: FIBO
isPartOf: pending.schema.org
comment: The difference between the price at which a broker or other intermediary buys and sells foreign currency.
source: https://github.com/schemaorg/schemaorg/issues/1253
domainIncludes: ExchangeRateSpecification
rangeIncludes: Number
rangeIncludes: MonetaryAmount

clipNumber
type: Property
comment: Position of the clip within an ordered group of clips.
sub property of: position
rangeIncludes: Text
rangeIncludes: Integer
domainIncludes: Clip

dateRead
type: Property
rangeIncludes: Date
rangeIncludes: DateTime
comment: The date/time at which the message has been read by the recipient if a single recipient exists.
domainIncludes: Message

BodyMeasurementWeight
type: BodyMeasurementTypeEnumeration
comment: Body weight. Used, for example, to measure pantyhose.
source: https://github.com/schemaorg/schemaorg/issues/2811
isPartOf: pending.schema.org

biologicalRole
type: Property
isPartOf: pending.schema.org
domainIncludes: BioChemEntity
comment: A role played by the BioChemEntity within a biological context.
source: www.bioschemas.org
rangeIncludes: DefinedTerm

lastReviewed
type: Property
rangeIncludes: Date
comment: Date on which the content on this web page was last reviewed for accuracy and/or completeness.
domainIncludes: WebPage

processingTime
type: Property
rangeIncludes: Duration
domainIncludes: ServiceChannel
comment: Estimated processing time for the service using this channel.

urlTemplate
type: Property
domainIncludes: EntryPoint
rangeIncludes: Text
comment: An url template (RFC6570) that will be used to construct the target of the execution of the action.

reportNumber
type: Property
comment: The number or other unique designator assigned to a Report by the publishing organization.
domainIncludes: Report
rangeIncludes: Text

featureList
type: Property
comment: Features or modules provided by this application (and possibly required by other applications).
domainIncludes: SoftwareApplication
rangeIncludes: URL
rangeIncludes: Text

Nonprofit501n
type: USNonprofitType
comment: Nonprofit501n: Non-profit type referring to Charitable Risk Pools.
source: https://github.com/schemaorg/schemaorg/issues/2543
isPartOf: pending.schema.org

sizeGroup
type: Property
source: https://github.com/schemaorg/schemaorg/issues/2811
rangeIncludes: Text
rangeIncludes: SizeGroupEnumeration
comment: The size group (also known as "size type") for a product's size. Size groups are common in the fashion industry to define size segments and suggested audiences for wearable products. Multiple values can be combined, for example "men's big and tall", "petite maternity" or "regular".
isPartOf: pending.schema.org
domainIncludes: SizeSpecification

MerchantReturnUnspecified
type: MerchantReturnEnumeration
comment: Specifies that a product return policy is not provided.
isPartOf: pending.schema.org
source: https://github.com/schemaorg/schemaorg/issues/2288

IOSPlatform
type: DigitalPlatformEnumeration
isPartOf: pending.schema.org
source: https://github.com/schemaorg/schemaorg/issues/3057
comment: Represents the broad notion of iOS-based operating systems.

DataDrivenMediaDigitalSource
type: IPTCDigitalSourceEnumeration
comment: Content coded as 'data driven media' using the IPTC digital source type vocabulary.
isPartOf: pending.schema.org
source: https://github.com/schemaorg/schemaorg/issues/3392

IncentiveStatusInDevelopment
type: IncentiveStatus
comment: This incentive is currently being developed, and may become active/retired in the future.
isPartOf: pending.schema.org
source: https://github.com/schemaorg/schemaorg/issues/3572

ListPrice
type: PriceTypeEnumeration
isPartOf: pending.schema.org
comment: Represents the list price of an offered product. Typically the same as the [MSRP](http://schema.org/MSRP).
source: https://github.com/schemaorg/schemaorg/issues/2712

displayLocation
type: Property
domainIncludes: Product
domainIncludes: CreativeWork
comment: The location at which an item can be viewed or experienced in-person.
isPartOf: pending.schema.org
rangeIncludes: Place
source: https://github.com/schemaorg/schemaorg/issues/4513

orderStatus
type: Property
domainIncludes: Order
rangeIncludes: OrderStatus
comment: The current status of the order.

iupacName
type: Property
isPartOf: pending.schema.org
rangeIncludes: Text
source: MolecularEntity
comment: Systematic method of naming chemical compounds as recommended by the International Union of Pure and Applied Chemistry (IUPAC).
domainIncludes: MolecularEntity

alternativeHeadline
type: Property
comment: A secondary title of the CreativeWork.
rangeIncludes: Text
domainIncludes: CreativeWork

bloodSupply
type: Property
isPartOf: health-lifesci.schema.org
domainIncludes: Muscle
comment: The blood vessel that carries blood from the heart to the muscle.
rangeIncludes: Vessel

CheckInAction
type: Class
comment: The act of an agent communicating (service provider, social media, etc) their arrival by registering/confirming for a previously reserved service (e.g. flight check-in) or at a place (e.g. hotel), possibly resulting in a result (boarding pass, etc).\n\nRelated actions:\n\n* CheckOutAction: The antonym of CheckInAction.\n* ArriveAction: Unlike ArriveAction, CheckInAction implies that the agent is informing/confirming the start of a previously reserved service.\n* ConfirmAction: Unlike ConfirmAction, CheckInAction implies that the agent is informing/confirming the *start* of a previously reserved service rather than its validity/existence.
subclass of: CommunicateAction

isConsumableFor
type: Property
comment: A pointer to another product (or multiple products) for which this product is a consumable.
contributor: GoodRelationsTerms
domainIncludes: Product
rangeIncludes: Product

geoIntersects
type: Property
rangeIncludes: Place
rangeIncludes: GeospatialGeometry
domainIncludes: GeospatialGeometry
domainIncludes: Place
comment: Represents spatial relations in which two geometries (or the places they represent) have at least one point in common. As defined in [DE-9IM](https://en.wikipedia.org/wiki/DE-9IM).

Attorney
type: Class
subclass of: LegalService
comment: Professional service: Attorney. \n\nThis type is deprecated - LegalService is more inclusive and less ambiguous.

SoundtrackAlbum
type: MusicAlbumProductionType
contributor: MBZ
comment: SoundtrackAlbum.

articleSection
type: Property
comment: Articles may belong to one or more 'sections' in a magazine or newspaper, such as Sports, Lifestyle, etc.
domainIncludes: Article
rangeIncludes: Text

ReturnLabelDownloadAndPrint
type: ReturnLabelSourceEnumeration
comment: Indicated that a return label must be downloaded and printed by the customer.
isPartOf: pending.schema.org
source: https://github.com/schemaorg/schemaorg/issues/2880

locationCreated
type: Property
comment: The location where the CreativeWork was created, which may not be the same as the location depicted in the CreativeWork.
rangeIncludes: Place
domainIncludes: CreativeWork

opens
type: Property
contributor: GoodRelationsTerms
domainIncludes: OpeningHoursSpecification
comment: The opening hour of the place or service on the given day(s) of the week.
rangeIncludes: Time

potentialAction
type: Property
rangeIncludes: Action
domainIncludes: Thing
comment: Indicates a potential Action, which describes an idealized action in which this thing would play an 'object' role.

Florist
type: Class
comment: A florist.
subclass of: Store

issuedBy
type: Property
domainIncludes: Ticket
domainIncludes: Permit
domainIncludes: Certification
rangeIncludes: Organization
comment: The organization issuing the item, for example a Permit, Ticket, or Certification.

OccupationalTherapy
type: Class
subclass of: MedicalTherapy
isPartOf: health-lifesci.schema.org
comment: A treatment of people with physical, emotional, or social problems, using purposeful activity to help them overcome or learn to deal with their problems.

relatedTherapy
type: Property
comment: A medical therapy related to this anatomy.
domainIncludes: AnatomicalSystem
domainIncludes: SuperficialAnatomy
domainIncludes: AnatomicalStructure
isPartOf: health-lifesci.schema.org
rangeIncludes: MedicalTherapy

subtitleLanguage
type: Property
domainIncludes: Movie
domainIncludes: TVEpisode
domainIncludes: BroadcastEvent
domainIncludes: ScreeningEvent
isPartOf: pending.schema.org
rangeIncludes: Text
rangeIncludes: Language
source: https://github.com/schemaorg/schemaorg/issues/2110
comment: Languages in which subtitles/captions are available, in [IETF BCP 47 standard format](http://tools.ietf.org/html/bcp47).

LowCalorieDiet
type: RestrictedDiet
comment: A diet focused on reduced calorie intake.

medicineSystem
type: Property
rangeIncludes: MedicineSystem
isPartOf: health-lifesci.schema.org
comment: The system of medicine that includes this MedicalEntity, for example 'evidence-based', 'homeopathic', 'chiropractic', etc.
domainIncludes: MedicalEntity

isResizable
type: Property
rangeIncludes: Boolean
comment: Whether the 3DModel allows resizing. For example, room layout applications often do not allow 3DModel elements to be resized to reflect reality.
domainIncludes: 3DModel
source: https://github.com/schemaorg/schemaorg/issues/2394
isPartOf: pending.schema.org

bankAccountType
type: Property
domainIncludes: BankAccount
comment: The type of a bank account.
rangeIncludes: URL
rangeIncludes: Text
source: https://github.com/schemaorg/schemaorg/issues/1253
contributor: FIBO
isPartOf: pending.schema.org

Toxicologic
type: MedicalSpecialty
comment: A specific branch of medical science that is concerned with poisons, their nature, effects and detection and involved in the treatment of poisoning.
isPartOf: health-lifesci.schema.org

reservationId
type: Property
domainIncludes: Reservation
rangeIncludes: Text
comment: A unique identifier for the reservation.

commentText
type: Property
comment: The text of the UserComment.
domainIncludes: UserComments
rangeIncludes: Text

OrderProblem
type: OrderStatus
comment: OrderStatus representing that there is a problem with the order.

program
type: Property
comment: The [MemberProgram](http://schema.org/MemberProgram) associated with a [ProgramMembership](http://schema.org/ProgramMembership).
rangeIncludes: MemberProgram
source: https://github.com/schemaorg/schemaorg/issues/3563
domainIncludes: ProgramMembership

answerExplanation
type: Property
rangeIncludes: Comment
rangeIncludes: WebContent
comment: A step-by-step or full explanation about Answer. Can outline how this Answer was achieved or contain more broad clarification or statement about it.
domainIncludes: Answer
isPartOf: pending.schema.org
source: https://github.com/schemaorg/schemaorg/issues/2636

proteinContent
type: Property
comment: The number of grams of protein.
domainIncludes: NutritionInformation
rangeIncludes: Mass

correction
type: Property
rangeIncludes: CorrectionComment
rangeIncludes: URL
rangeIncludes: Text
isPartOf: pending.schema.org
domainIncludes: CreativeWork
comment: Indicates a correction to a CreativeWork, either via a CorrectionComment, textually or in another document.
contributor: TP
source: https://github.com/schemaorg/schemaorg/issues/1950

performerIn
type: Property
comment: Event that this person is a performer or participant in.
rangeIncludes: Event
domainIncludes: Person

AlgorithmicallyEnhancedDigitalSource
type: IPTCDigitalSourceEnumeration
isPartOf: pending.schema.org
comment: Content coded as 'algorithmically enhanced' using the IPTC digital source type vocabulary.
source: https://github.com/schemaorg/schemaorg/issues/3392

childMinAge
type: Property
domainIncludes: ParentAudience
comment: Minimal age of the child.
rangeIncludes: Number

line
type: Property
comment: A line is a point-to-point path consisting of two or more points. A line is expressed as a series of two or more point objects separated by space.
domainIncludes: GeoShape
rangeIncludes: Text

albums
type: Property
domainIncludes: MusicGroup
supersededBy: album
comment: A collection of music albums.
rangeIncludes: MusicAlbum

album
type: Property
rangeIncludes: MusicAlbum
domainIncludes: MusicGroup
comment: A music album.

identifyingExam
type: Property
isPartOf: health-lifesci.schema.org
rangeIncludes: PhysicalExam
comment: A physical examination that can identify this sign.
domainIncludes: MedicalSign

StagesHealthAspect
type: HealthAspectEnumeration
isPartOf: pending.schema.org
comment: Stages that can be observed from a topic.
source: https://github.com/schemaorg/schemaorg/issues/2374

AlbumRelease
type: MusicAlbumReleaseType
comment: AlbumRelease.
contributor: MBZ

inventoryLevel
type: Property
comment: The current approximate inventory level for the item or items.
domainIncludes: Offer
domainIncludes: SomeProducts
domainIncludes: Demand
contributor: GoodRelationsTerms
rangeIncludes: QuantitativeValue

permittedUsage
type: Property
comment: Indications regarding the permitted usage of the accommodation.
domainIncludes: Accommodation
contributor: STI Accommodation Ontology
rangeIncludes: Text

sportsTeam
type: Property
rangeIncludes: SportsTeam
domainIncludes: ExerciseAction
sub property of: participant
comment: A sub property of participant. The sports team that participated on this action.

mathExpression
type: Property
isPartOf: pending.schema.org
source: https://github.com/schemaorg/schemaorg/issues/2740
comment: A mathematical expression (e.g. 'x^2-3x=0') that may be solved for a specific variable, simplified, or transformed. This can take many formats, e.g. LaTeX, Ascii-Math, or math as you would write with a keyboard.
domainIncludes: MathSolver
rangeIncludes: SolveMathAction
rangeIncludes: Text

mediaAuthenticityCategory
type: Property
isPartOf: pending.schema.org
comment: Indicates a MediaManipulationRatingEnumeration classification of a media object (in the context of how it was published or shared).
domainIncludes: MediaReview
source: https://github.com/schemaorg/schemaorg/issues/2450
rangeIncludes: MediaManipulationRatingEnumeration

SelfCareHealthAspect
type: HealthAspectEnumeration
source: https://github.com/schemaorg/schemaorg/issues/2374
comment: Self care actions or measures that can be taken to sooth, health or avoid a topic. This may be carried at home and can be carried/managed by the person itself.
isPartOf: pending.schema.org

height
type: Property
domainIncludes: MediaObject
domainIncludes: Person
domainIncludes: VisualArtwork
domainIncludes: OfferShippingDetails
domainIncludes: Product
domainIncludes: ShippingConditions
comment: The height of the item.
source: https://github.com/schemaorg/schemaorg/issues/3617
rangeIncludes: QuantitativeValue
rangeIncludes: Distance

suggestedGender
type: Property
rangeIncludes: Text
rangeIncludes: GenderType
domainIncludes: PeopleAudience
domainIncludes: SizeSpecification
comment: The suggested gender of the intended person or audience, for example "male", "female", or "unisex".

AutomatedTeller
type: Class
subclass of: FinancialService
comment: ATM/cash machine.

qualifiedExpense
type: Property
domainIncludes: FinancialIncentive
isPartOf: pending.schema.org
source: https://github.com/schemaorg/schemaorg/issues/3572
rangeIncludes: IncentiveQualifiedExpenseType
comment: Optional. The types of expenses that are covered by the incentive. For example some incentives are only for the goods (tangible items) but the services (labor) are excluded.

releaseDate
type: Property
equivalent property: ProductAvailabilityDate
comment: The release date of a product or product model. This can be used to distinguish the exact variant of a product.
contributor: GoodRelationsTerms
domainIncludes: Product
rangeIncludes: Date

PartiallyInForce
type: LegalForceStatus
isPartOf: pending.schema.org
source: https://github.com/schemaorg/schemaorg/issues/1156
source: eli
contributor: ELI
comment: Indicates that parts of the legislation are in force, and parts are not.

ToyStore
type: Class
subclass of: Store
comment: A toy store.

trainName
type: Property
domainIncludes: TrainTrip
comment: The name of the train (e.g. The Orient Express).
rangeIncludes: Text

Ayurvedic
type: MedicineSystem
comment: A system of medicine that originated in India over thousands of years and that focuses on integrating and balancing the body, mind, and spirit.
isPartOf: health-lifesci.schema.org

OfferForPurchase
type: Class
subclass of: Offer
isPartOf: pending.schema.org
comment: An OfferForPurchase in Schema.org represents an Offer to sell something, i.e. an Offer whose businessFunction is [sell](http://purl.org/goodrelations/v1#Sell.). See [Good Relations](https://en.wikipedia.org/wiki/GoodRelations) for background on the underlying concepts.
source: https://github.com/schemaorg/schemaorg/issues/2348

RadioBroadcastService
type: Class
isPartOf: pending.schema.org
subclass of: BroadcastService
source: https://github.com/schemaorg/schemaorg/issues/2109
comment: A delivery service through which radio content is provided via broadcast over the air or online.

ImageObjectSnapshot
type: Class
isPartOf: pending.schema.org
comment: A specific and exact (byte-for-byte) version of an ImageObject. Two byte-for-byte identical files, for the purposes of this type, considered identical. If they have different embedded metadata (e.g. XMP, EXIF) the files will differ. Different external facts about the files, e.g. creator or dateCreated that aren't represented in their actual content, do not affect this notion of identity.
source: https://github.com/schemaorg/schemaorg/issues/2450
subclass of: ImageObject

ClothingStore
type: Class
comment: A clothing store.
subclass of: Store

trialDesign
type: Property
rangeIncludes: MedicalTrialDesign
domainIncludes: MedicalTrial
comment: Specifics about the trial design (enumerated).
isPartOf: health-lifesci.schema.org

jobLocationType
type: Property
comment: A description of the job location (e.g. TELECOMMUTE for telecommute jobs).
domainIncludes: JobPosting
rangeIncludes: Text
source: https://github.com/schemaorg/schemaorg/issues/1591
isPartOf: pending.schema.org

startTime
type: Property
domainIncludes: MediaObject
domainIncludes: FoodEstablishmentReservation
domainIncludes: InteractionCounter
domainIncludes: Action
domainIncludes: Schedule
source: https://github.com/schemaorg/schemaorg/issues/2493
comment: The startTime of something. For a reserved event or service (e.g. FoodEstablishmentReservation), the time that it is expected to start. For actions that span a period of time, when the action was performed. E.g. John wrote a book from *January* to December. For media, including audio and video, it's the time offset of the start of a clip within a larger file.\n\nNote that Event uses startDate/endDate instead of startTime/endTime, even when describing dates with times. This situation may be clarified in future revisions.
rangeIncludes: DateTime
rangeIncludes: Time

accountOverdraftLimit
type: Property
contributor: FIBO
isPartOf: pending.schema.org
comment: An overdraft is an extension of credit from a lending institution when an account reaches zero. An overdraft allows the individual to continue withdrawing money even if the account has no funds in it. Basically the bank allows people to borrow a set amount of money.
source: https://github.com/schemaorg/schemaorg/issues/1253
domainIncludes: BankAccount
rangeIncludes: MonetaryAmount

dateIssued
type: Property
domainIncludes: Ticket
comment: The date the ticket was issued.
rangeIncludes: DateTime
rangeIncludes: Date

CafeOrCoffeeShop
type: Class
comment: A cafe or coffee shop.
subclass of: FoodEstablishment

recommendationStrength
type: Property
rangeIncludes: Text
comment: Strength of the guideline's recommendation (e.g. 'class I').
isPartOf: health-lifesci.schema.org
domainIncludes: MedicalGuidelineRecommendation

NightClub
type: Class
comment: A nightclub or discotheque.
subclass of: EntertainmentBusiness

paymentMethodType
type: Property
comment: The type of a payment method.
rangeIncludes: PaymentMethodType
domainIncludes: PaymentMethod
isPartOf: pending.schema.org
source: https://github.com/schemaorg/schemaorg/issues/3537

Nonprofit501c11
type: USNonprofitType
comment: Nonprofit501c11: Non-profit type referring to Teachers' Retirement Fund Associations.
source: https://github.com/schemaorg/schemaorg/issues/2543
isPartOf: pending.schema.org

Nonprofit501c24
type: USNonprofitType
source: https://github.com/schemaorg/schemaorg/issues/2543
isPartOf: pending.schema.org
comment: Nonprofit501c24: Non-profit type referring to Section 4049 ERISA Trusts.

IncentiveTypeRebateOrSubsidy
type: IncentiveType
comment: An incentive that reduces the purchase/lease cost of the good/service in question.
isPartOf: pending.schema.org
source: https://github.com/schemaorg/schemaorg/issues/3572

Protozoa
type: InfectiousAgentClass
isPartOf: health-lifesci.schema.org
comment: Single-celled organism that causes an infection.

employerOverview
type: Property
rangeIncludes: Text
domainIncludes: JobPosting
source: https://github.com/schemaorg/schemaorg/issues/2396
comment: A description of the employer, career opportunities and work environment for this position.
isPartOf: pending.schema.org

PurchaseTypeLease
type: PurchaseType
comment: This is a lease of an item.
isPartOf: pending.schema.org
source: https://github.com/schemaorg/schemaorg/issues/3572

busNumber
type: Property
domainIncludes: BusTrip
rangeIncludes: Text
comment: The unique identifier for the bus.

NewCondition
type: OfferItemCondition
comment: Indicates that the item is new.

FastFoodRestaurant
type: Class
subclass of: FoodEstablishment
comment: A fast-food restaurant.

manufacturer
type: Property
rangeIncludes: Organization
domainIncludes: Product
sub property of: isProvisionedBy
equivalent property: manufacturerParty
equivalent property: manufacturer
comment: The manufacturer of the product.

doseUnit
type: Property
domainIncludes: DoseSchedule
isPartOf: health-lifesci.schema.org
comment: The unit of the dose, e.g. 'mg'.
rangeIncludes: Text

Homeopathic
type: MedicineSystem
isPartOf: health-lifesci.schema.org
comment: A system of medicine based on the principle that a disease can be cured by a substance that produces similar symptoms in healthy people.

discountCode
type: Property
rangeIncludes: Text
domainIncludes: Order
comment: Code used to redeem a discount.

FilmAction
type: Class
subclass of: CreateAction
comment: The act of capturing sound and moving images on film, video, or digitally.

calories
type: Property
domainIncludes: NutritionInformation
rangeIncludes: Energy
comment: The number of calories.

employees
type: Property
comment: People working for this organization.
domainIncludes: Organization
rangeIncludes: Person
supersededBy: employee

employee
type: Property
rangeIncludes: Person
comment: Someone working for this organization.
domainIncludes: Organization

IncentiveQualifiedExpenseTypeServicesOnly
type: IncentiveQualifiedExpenseType
isPartOf: pending.schema.org
source: https://github.com/schemaorg/schemaorg/issues/3572
comment: This incentive applies to services only.

drainsTo
type: Property
comment: The vasculature that the vein drains into.
rangeIncludes: Vessel
isPartOf: health-lifesci.schema.org
domainIncludes: Vein

broadcastOfEvent
type: Property
rangeIncludes: Event
domainIncludes: BroadcastEvent
comment: The event being broadcast such as a sporting event or awards ceremony.

legalRepresentative
type: Property
rangeIncludes: Person
comment: One or multiple persons who represent this organization legally such as CEO or sole administrator.
domainIncludes: Organization

healthPlanDrugOption
type: Property
comment: TODO.
rangeIncludes: Text
isPartOf: pending.schema.org
source: https://github.com/schemaorg/schemaorg/issues/1062
domainIncludes: HealthInsurancePlan

coursePrerequisites
type: Property
rangeIncludes: Course
rangeIncludes: AlignmentObject
rangeIncludes: Text
comment: Requirements for taking the Course. May be completion of another Course or a textual description like "permission of instructor". Requirements may be a pre-requisite competency, referenced using AlignmentObject.
domainIncludes: Course

stage
type: Property
rangeIncludes: MedicalConditionStage
domainIncludes: MedicalCondition
isPartOf: health-lifesci.schema.org
comment: The stage of the condition, if applicable.

RadiationTherapy
type: Class
comment: A process of care using radiation aimed at improving a health condition.
subclass of: MedicalTherapy
isPartOf: health-lifesci.schema.org

CT
type: MedicalImagingTechnique
isPartOf: health-lifesci.schema.org
comment: X-ray computed tomography imaging.

bookEdition
type: Property
domainIncludes: Book
rangeIncludes: Text
comment: The edition of the book.

seatSection
type: Property
rangeIncludes: Text
domainIncludes: Seat
comment: The section location of the reserved seat (e.g. Orchestra).

numAdults
type: Property
rangeIncludes: QuantitativeValue
rangeIncludes: Integer
domainIncludes: LodgingReservation
comment: The number of adults staying in the unit.

hasTierBenefit
type: Property
domainIncludes: MemberProgramTier
comment: A member benefit for a particular tier of a loyalty program.
rangeIncludes: TierBenefitEnumeration
source: https://github.com/schemaorg/schemaorg/issues/3563

articleBody
type: Property
domainIncludes: Article
rangeIncludes: Text
comment: The actual body of the article.

typicalTest
type: Property
isPartOf: health-lifesci.schema.org
comment: A medical test typically performed given this condition.
rangeIncludes: MedicalTest
domainIncludes: MedicalCondition

defaultValue
type: Property
rangeIncludes: Text
rangeIncludes: Thing
domainIncludes: PropertyValueSpecification
comment: The default value of the input. For properties that expect a literal, the default is a literal value, for properties that expect an object, it's an ID reference to one of the current values.

SingleCenterTrial
type: MedicalTrialDesign
comment: A trial that takes place at a single center.
isPartOf: health-lifesci.schema.org

Urologic
type: MedicalSpecialty
comment: A specific branch of medical science that is concerned with the diagnosis and treatment of diseases pertaining to the urinary tract and the urogenital system.
isPartOf: health-lifesci.schema.org

primaryImageOfPage
type: Property
rangeIncludes: ImageObject
domainIncludes: WebPage
comment: Indicates the main image on the page.

statType
type: Property
rangeIncludes: Text
rangeIncludes: Property
rangeIncludes: URL
domainIncludes: StatisticalVariable
isPartOf: pending.schema.org
source: https://github.com/schemaorg/schemaorg/issues/2564
comment: Indicates the kind of statistic represented by a StatisticalVariable, e.g. mean, count etc. The value of statType is a property, either from within Schema.org (e.g. median, marginOfError, maxValue, minValue) or from other compatible (e.g. RDF) systems such as DataCommons.org or Wikidata.org.

FoodService
type: Class
comment: A food service, like breakfast, lunch, or dinner.
contributor: STI Accommodation Ontology
subclass of: Service

sdPublisher
type: Property
rangeIncludes: Person
rangeIncludes: Organization
comment: Indicates the party responsible for generating and publishing the current structured data markup, typically in cases where the structured data is derived automatically from existing published content but published on a different site. For example, student projects and open data initiatives often re-publish existing content with more explicitly structured metadata. The sdPublisher property helps make such practices more explicit.
source: https://github.com/schemaorg/schemaorg/issues/1886
domainIncludes: CreativeWork
isPartOf: pending.schema.org

BookSeries
type: Class
subclass of: CreativeWorkSeries
comment: A series of books. Included books can be indicated with the hasPart property.

catalogNumber
type: Property
contributor: MBZ
rangeIncludes: Text
domainIncludes: MusicRelease
comment: The catalog number for the release.

includesAttraction
type: Property
isPartOf: pending.schema.org
domainIncludes: TouristDestination
comment: Attraction located at destination.
contributor: Tourism
contributor: IIT-CNR.it
rangeIncludes: TouristAttraction
source: https://github.com/schemaorg/schemaorg/issues/1810

Nonprofit501d
type: USNonprofitType
comment: Nonprofit501d: Non-profit type referring to Religious and Apostolic Associations.
isPartOf: pending.schema.org
source: https://github.com/schemaorg/schemaorg/issues/2543

qualifications
type: Property
rangeIncludes: EducationalOccupationalCredential
rangeIncludes: Text
domainIncludes: JobPosting
domainIncludes: Occupation
comment: Specific qualifications required for this role or Occupation.
source: https://github.com/schemaorg/schemaorg/issues/1779
source: https://github.com/schemaorg/schemaorg/issues/1698
isPartOf: pending.schema.org

openingHours
type: Property
domainIncludes: CivicStructure
domainIncludes: LocalBusiness
rangeIncludes: Text
comment: The general opening hours for a business. Opening hours can be specified as a weekly time range, starting with days, then times per day. Multiple days can be listed with commas ',' separating each day. Day or time ranges are specified using a hyphen '-'.\n\n* Days are specified using the following two-letter combinations: ```Mo```, ```Tu```, ```We```, ```Th```, ```Fr```, ```Sa```, ```Su```.\n* Times are specified using 24:00 format. For example, 3pm is specified as ```15:00```, 10am as ```10:00```. \n* Here is an example: Tuesdays and Thursdays 4-8pm .\n* If a business is open 7 days a week, then it can be specified as Monday through Sunday, all day .

claimReviewed
type: Property
comment: A short summary of the specific claims reviewed in a ClaimReview.
rangeIncludes: Text
domainIncludes: ClaimReview
source: https://github.com/schemaorg/schemaorg/issues/1061

MensClothingStore
type: Class
comment: A men's clothing store.
subclass of: Store

actors
type: Property
rangeIncludes: Person
domainIncludes: Movie
domainIncludes: VideoGameSeries
domainIncludes: VideoGame
domainIncludes: MovieSeries
domainIncludes: Clip
domainIncludes: Episode
domainIncludes: VideoObject
domainIncludes: RadioSeries
domainIncludes: TVSeries
supersededBy: actor
comment: An actor, e.g. in TV, radio, movie, video games etc. Actors can be associated with individual items or with a series, episode, clip.

extendedAddress
type: Property
domainIncludes: PostalAddress
comment: An address extension such as an apartment number, C/O or alternative name.
rangeIncludes: Text

VacationRental
type: Class
comment: A kind of lodging business that focuses on renting single properties for limited time.
subclass of: LodgingBusiness

JewelryStore
type: Class
subclass of: Store
comment: A jewelry store.

SpeechPathology
type: MedicalSpecialty
isPartOf: health-lifesci.schema.org
comment: The scientific study and treatment of defects, disorders, and malfunctions of speech and voice, as stuttering, lisping, or lalling, and of language disturbances, as aphasia or delayed language acquisition.

HealthClub
type: Class
subclass of: HealthAndBeautyBusiness
subclass of: SportsActivityLocation
comment: A health club.

ContagiousnessHealthAspect
type: HealthAspectEnumeration
comment: Content about contagion mechanisms and contagiousness information over the topic.
isPartOf: pending.schema.org
source: https://github.com/schemaorg/schemaorg/issues/2374

possibleComplication
type: Property
comment: A possible unexpected and unfavorable evolution of a medical condition. Complications may include worsening of the signs or symptoms of the disease, extension of the condition to other organ systems, etc.
domainIncludes: MedicalCondition
isPartOf: health-lifesci.schema.org
rangeIncludes: Text

TennisComplex
type: Class
comment: A tennis complex.
subclass of: SportsActivityLocation

serviceSmsNumber
type: Property
domainIncludes: ServiceChannel
comment: The number to access the service by text message.
sub property of: hasAddress
rangeIncludes: ContactPoint

accessibilitySummary
type: Property
domainIncludes: CreativeWork
comment: A human-readable summary of specific accessibility features or deficiencies, consistent with the other accessibility metadata but expressing subtleties such as "short descriptions are present but long descriptions will be needed for non-visual users" or "short descriptions are present and no long descriptions are needed".
source: https://github.com/schemaorg/schemaorg/issues/1100
rangeIncludes: Text

WearableSizeGroupBoys
type: WearableSizeGroupEnumeration
source: https://github.com/schemaorg/schemaorg/issues/2811
comment: Size group "Boys" for wearables.
isPartOf: pending.schema.org

DepartAction
type: Class
comment: The act of departing from a place. An agent departs from a fromLocation for a destination, optionally with participants.
subclass of: MoveAction

musicBy
type: Property
domainIncludes: Movie
domainIncludes: Clip
domainIncludes: Episode
domainIncludes: VideoGame
domainIncludes: MovieSeries
domainIncludes: VideoObject
domainIncludes: TVSeries
domainIncludes: RadioSeries
domainIncludes: VideoGameSeries
comment: The composer of the soundtrack.
rangeIncludes: MusicGroup
rangeIncludes: Person

DisabilitySupport
type: GovernmentBenefitsType
isPartOf: pending.schema.org
comment: DisabilitySupport: this is a benefit for disability support.
source: https://github.com/schemaorg/schemaorg/issues/2534

ViewAction
type: Class
subclass of: ConsumeAction
comment: The act of consuming static visual content.

NoninvasiveProcedure
type: MedicalProcedureType
isPartOf: health-lifesci.schema.org
comment: A type of medical procedure that involves noninvasive techniques.

AskPublicNewsArticle
type: Class
source: https://github.com/schemaorg/schemaorg/issues/1525
contributor: TP
isPartOf: pending.schema.org
subclass of: NewsArticle
comment: A NewsArticle expressing an open call by a NewsMediaOrganization asking the public for input, insights, clarifications, anecdotes, documentation, etc., on an issue, for reporting purposes.

tongueWeight
type: Property
comment: The permitted vertical load (TWR) of a trailer attached to the vehicle. Also referred to as Tongue Load Rating (TLR) or Vertical Load Rating (VLR).\n\nTypical unit code(s): KGM for kilogram, LBR for pound\n\n* Note 1: You can indicate additional information in the name of the QuantitativeValue node.\n* Note 2: You may also link to a QualitativeValue node that provides additional information using valueReference.\n* Note 3: Note that you can use minValue and maxValue to indicate ranges.
contributor: Automotive Ontology Working Group
domainIncludes: Vehicle
rangeIncludes: QuantitativeValue
isPartOf: auto.schema.org

icaoCode
type: Property
rangeIncludes: Text
domainIncludes: Airport
comment: ICAO identifier for an airport.

hasEnergyEfficiencyCategory
type: Property
isPartOf: pending.schema.org
rangeIncludes: EnergyEfficiencyEnumeration
source: https://github.com/schemaorg/schemaorg/issues/2670
domainIncludes: EnergyConsumptionDetails
comment: Defines the energy efficiency Category (which could be either a rating out of range of values or a yes/no certification) for a product according to an international energy efficiency standard.

State
type: Class
subclass of: AdministrativeArea
comment: A state or province of a country.

TierBenefitLoyaltyPrice
type: TierBenefitEnumeration
comment: Benefit of the tier is a members-only price.
source: https://github.com/schemaorg/schemaorg/issues/3563
isPartOf: pending.schema.org

timeOfDay
type: Property
source: https://github.com/schemaorg/schemaorg/issues/2419
comment: The time of day the program normally runs. For example, "evenings".
rangeIncludes: Text
domainIncludes: EducationalOccupationalProgram
isPartOf: pending.schema.org

permissionType
type: Property
comment: The type of permission granted the person, organization, or audience.
rangeIncludes: DigitalDocumentPermissionType
domainIncludes: DigitalDocumentPermission

OrderReturned
type: OrderStatus
comment: OrderStatus representing that an order has been returned.

MerchantReturnUnlimitedWindow
type: MerchantReturnEnumeration
comment: Specifies that there is an unlimited window for product returns.
isPartOf: pending.schema.org
source: https://github.com/schemaorg/schemaorg/issues/2288

gameTip
type: Property
domainIncludes: VideoGame
rangeIncludes: CreativeWork
comment: Links to tips, tactics, etc.

WearableSizeGroupPlus
type: WearableSizeGroupEnumeration
source: https://github.com/schemaorg/schemaorg/issues/2811
isPartOf: pending.schema.org
comment: Size group "Plus" for wearables.

costCategory
type: Property
isPartOf: health-lifesci.schema.org
domainIncludes: DrugCost
comment: The category of cost, such as wholesale, retail, reimbursement cap, etc.
rangeIncludes: DrugCostCategory

associatedMediaReview
type: Property
domainIncludes: Review
isPartOf: pending.schema.org
rangeIncludes: Review
sub property of: associatedReview
comment: An associated MediaReview, related by specific common content, topic or claim. The expectation is that this property would be most typically used in cases where a single activity is conducting both claim reviews and media reviews, in which case relatedMediaReview would commonly be used on a ClaimReview, while relatedClaimReview would be used on MediaReview.
source: https://github.com/schemaorg/schemaorg/issues/2450

inStoreReturnsOffered
type: Property
isPartOf: pending.schema.org
comment: Are in-store returns offered? (For more advanced return methods use the returnMethod property.)
source: https://github.com/schemaorg/schemaorg/issues/2288
rangeIncludes: Boolean
domainIncludes: MerchantReturnPolicy

maps
type: Property
domainIncludes: Place
supersededBy: hasMap
comment: A URL to a map of the place.
rangeIncludes: URL

countriesSupported
type: Property
rangeIncludes: Text
comment: Countries for which the application is supported. You can also provide the two-letter ISO 3166-1 alpha-2 country code.
domainIncludes: SoftwareApplication

ActiveActionStatus
type: ActionStatusType
comment: An in-progress action (e.g., while watching the movie, or driving to a location).

Saturday
type: DayOfWeek
comment: The day of the week between Friday and Sunday.

citation
type: Property
comment: A citation or reference to another creative work, such as another publication, web page, scholarly article, etc.
rangeIncludes: Text
rangeIncludes: CreativeWork
domainIncludes: CreativeWork

PoliceStation
type: Class
subclass of: CivicStructure
subclass of: EmergencyService
comment: A police station.

incentiveType
type: Property
domainIncludes: FinancialIncentive
isPartOf: pending.schema.org
source: https://github.com/schemaorg/schemaorg/issues/3572
comment: The type of incentive offered (tax credit/rebate, tax deduction, tax waiver, subsidies, etc.).
rangeIncludes: IncentiveType

Poster
type: Class
comment: A large, usually printed placard, bill, or announcement, often illustrated, that is posted to advertise or publicize something.
isPartOf: pending.schema.org
source: https://github.com/schemaorg/schemaorg/issues/1448
subclass of: CreativeWork

CityHall
type: Class
subclass of: GovernmentBuilding
comment: A city hall.

SexualContentConsideration
type: AdultOrientedEnumeration
isPartOf: pending.schema.org
source: https://github.com/schemaorg/schemaorg/issues/2989
comment: The item contains sexually oriented content such as nudity, suggestive or explicit material, or related online services, or is intended to enhance sexual activity. Examples: Erotic videos or magazine, sexual enhancement devices, sex toys.

toRecipient
type: Property
domainIncludes: Message
comment: A sub property of recipient. The recipient who was directly sent the message.
rangeIncludes: ContactPoint
rangeIncludes: Person
rangeIncludes: Organization
rangeIncludes: Audience
sub property of: recipient

OrderProcessing
type: OrderStatus
comment: OrderStatus representing that an order is being processed.

incentives
type: Property
supersededBy: incentiveCompensation
comment: Description of bonus and commission compensation aspects of the job.
domainIncludes: JobPosting
rangeIncludes: Text

incentiveCompensation
type: Property
comment: Description of bonus and commission compensation aspects of the job.
domainIncludes: JobPosting
rangeIncludes: Text

NGO
type: Class
subclass of: Organization
equivalent class: NonGovernmentalOrganization
comment: Organization: Non-governmental Organization.

MadeToOrder
type: ItemAvailability
comment: Indicates that the item is made to order (custom made).

ConferenceEvent
type: Class
subclass of: Event
source: https://github.com/schemaorg/schemaorg/issues/4495
comment: Event type: Conference event.
isPartOf: pending.schema.org

dateReceived
type: Property
comment: The date/time the message was received if a single recipient exists.
domainIncludes: Message
rangeIncludes: DateTime

SizeSystemMetric
type: SizeSystemEnumeration
comment: Metric size system.
isPartOf: pending.schema.org
source: https://github.com/schemaorg/schemaorg/issues/2811

healthPlanNetworkTier
type: Property
isPartOf: pending.schema.org
comment: The tier(s) for this network.
source: https://github.com/schemaorg/schemaorg/issues/1062
rangeIncludes: Text
domainIncludes: HealthPlanNetwork

CollegeOrUniversity
type: Class
subclass of: EducationalOrganization
comment: A college, university, or other third-level educational institution.

NonprofitANBI
type: NLNonprofitType
isPartOf: pending.schema.org
comment: NonprofitANBI: Non-profit type referring to a Public Benefit Organization (NL).
source: https://github.com/schemaorg/schemaorg/issues/2543

CompleteDataFeed
type: Class
subclass of: DataFeed
isPartOf: pending.schema.org
comment: A CompleteDataFeed is a DataFeed whose standard representation includes content for every item currently in the feed. This is the equivalent of Atom's element as defined in Feed Paging and Archiving [RFC 5005](https://tools.ietf.org/html/rfc5005), for example (and as defined for Atom), when using data from a feed that represents a collection of items that varies over time (e.g. "Top Twenty Records") there is no need to have newer entries mixed in alongside older, obsolete entries. By marking this feed as a CompleteDataFeed, old entries can be safely discarded when the feed is refreshed, since we can assume the feed has provided descriptions for all current items.
source: https://github.com/schemaorg/schemaorg/issues/1397

Consortium
type: Class
source: https://github.com/schemaorg/schemaorg/issues/1559
comment: A Consortium is a membership Organization whose members are typically Organizations.
subclass of: Organization
isPartOf: pending.schema.org

sku
type: Property
domainIncludes: Offer
domainIncludes: Product
domainIncludes: Demand
equivalent property: sellerAssignedId
contributor: GoodRelationsTerms
comment: The Stock Keeping Unit (SKU), i.e. a merchant-specific identifier for a product or service, or the product to which the offer refers.
rangeIncludes: Text
sub property of: identifier

dissolutionDate
type: Property
rangeIncludes: Date
equivalent property: organizationTerminationDate
domainIncludes: Organization
comment: The date that this organization was dissolved.

hasEnergyConsumptionDetails
type: Property
domainIncludes: Product
comment: Defines the energy efficiency Category (also known as "class" or "rating") for a product according to an international energy efficiency standard.
isPartOf: pending.schema.org
source: https://github.com/schemaorg/schemaorg/issues/2670
rangeIncludes: EnergyConsumptionDetails

priceValidUntil
type: Property
domainIncludes: Offer
equivalent property: EffectiveEndDateTime
sub property of: endDate
rangeIncludes: Date
comment: The date after which the price is no longer available.

endDate
type: Property
domainIncludes: EducationalOccupationalProgram
domainIncludes: MerchantReturnPolicySeasonalOverride
domainIncludes: CreativeWorkSeason
domainIncludes: CreativeWorkSeries
domainIncludes: DatedMoneySpecification
domainIncludes: Role
domainIncludes: Schedule
domainIncludes: Event
equivalent property: hasEndDate
rangeIncludes: DateTime
rangeIncludes: Date
source: https://github.com/schemaorg/schemaorg/issues/2486
comment: The end date and time of the item (in [ISO 8601 date format](http://en.wikipedia.org/wiki/ISO_8601)).

AnaerobicActivity
type: PhysicalActivityCategory
comment: Physical activity that is of high-intensity which utilizes the anaerobic metabolism of the body.
isPartOf: health-lifesci.schema.org

BodyMeasurementHand
type: BodyMeasurementTypeEnumeration
isPartOf: pending.schema.org
comment: Maximum hand girth (measured over the knuckles of the open right hand excluding thumb, fingers together). Used, for example, to fit gloves.
source: https://github.com/schemaorg/schemaorg/issues/2811

contactType
type: Property
domainIncludes: ContactPoint
comment: A person or organization can have different contact points, for different purposes. For example, a sales contact point, a PR contact point and so on. This property is used to specify the kind of contact point.
equivalent property: contactType
rangeIncludes: Text

PaidLeave
type: GovernmentBenefitsType
source: https://github.com/schemaorg/schemaorg/issues/2534
isPartOf: pending.schema.org
comment: PaidLeave: this is a benefit for paid leave.

CovidTestingFacility
type: Class
subclass of: MedicalClinic
comment: A CovidTestingFacility is a MedicalClinic where testing for the COVID-19 Coronavirus disease is available. If the facility is being made available from an established Pharmacy, Hotel, or other non-medical organization, multiple types can be listed. This makes it easier to re-use existing schema.org information about that place, e.g. contact info, address, opening hours. Note that in an emergency, such information may not always be reliable.
isPartOf: pending.schema.org
source: https://github.com/schemaorg/schemaorg/issues/2490

confirmationNumber
type: Property
rangeIncludes: Text
domainIncludes: Invoice
domainIncludes: Order
comment: A number that confirms the given order or payment has been received.
sub property of: identifier

associatedPathophysiology
type: Property
comment: If applicable, a description of the pathophysiology associated with the anatomical system, including potential abnormal changes in the mechanical, physical, and biochemical functions of the system.
domainIncludes: AnatomicalSystem
domainIncludes: SuperficialAnatomy
domainIncludes: AnatomicalStructure
isPartOf: health-lifesci.schema.org
rangeIncludes: Text

Observational
type: MedicalObservationalStudyDesign
isPartOf: health-lifesci.schema.org
comment: An observational study design.

GettingAccessHealthAspect
type: HealthAspectEnumeration
source: https://github.com/schemaorg/schemaorg/issues/2799
comment: Content that discusses practical and policy aspects for getting access to specific kinds of healthcare (e.g. distribution mechanisms for vaccines).
isPartOf: pending.schema.org

LiquorStore
type: Class
comment: A shop that sells alcoholic drinks such as wine, beer, whisky and other spirits.
subclass of: Store

vehicleSeatingCapacity
type: Property
rangeIncludes: QuantitativeValue
rangeIncludes: Number
contributor: Automotive Ontology Working Group
domainIncludes: Vehicle
comment: The number of passengers that can be seated in the vehicle, both in terms of the physical space available, and in terms of limitations set by law.\n\nTypical unit code(s): C62 for persons.

actionAccessibilityRequirement
type: Property
rangeIncludes: ActionAccessSpecification
comment: A set of requirements that must be fulfilled in order to perform an Action. If more than one value is specified, fulfilling one set of requirements will allow the Action to be performed.
source: https://github.com/schemaorg/schemaorg/issues/1741
domainIncludes: ConsumeAction

ReservationConfirmed
type: ReservationStatusType
comment: The status of a confirmed reservation.

deliveryAddress
type: Property
comment: Destination address.
domainIncludes: ParcelDelivery
rangeIncludes: PostalAddress
equivalent property: ShipToAddress

ticketToken
type: Property
domainIncludes: Ticket
rangeIncludes: URL
rangeIncludes: Text
comment: Reference to an asset (e.g., Barcode, QR code image or PDF) usable for entrance.

LeisureTimeActivity
type: PhysicalActivityCategory
comment: Any physical activity engaged in for recreational purposes. Examples may include ballroom dancing, roller skating, canoeing, fishing, etc.
isPartOf: health-lifesci.schema.org

Registry
type: MedicalObservationalStudyDesign
isPartOf: health-lifesci.schema.org
comment: A registry-based study design.

WearableSizeGroupMens
type: WearableSizeGroupEnumeration
isPartOf: pending.schema.org
comment: Size group "Mens" for wearables.
source: https://github.com/schemaorg/schemaorg/issues/2811

SearchRescueOrganization
type: Class
comment: A Search and Rescue organization of some kind.
source: https://github.com/schemaorg/schemaorg/issues/3052
subclass of: Organization
isPartOf: pending.schema.org

Musculoskeletal
type: MedicalSpecialty
isPartOf: health-lifesci.schema.org
comment: A specific branch of medical science that pertains to diagnosis and treatment of disorders of muscles, ligaments and skeletal system.

ReturnByMail
type: ReturnMethodEnumeration
comment: Specifies that product returns must be done by mail.
isPartOf: pending.schema.org
source: https://github.com/schemaorg/schemaorg/issues/2880

applicableLocation
type: Property
rangeIncludes: AdministrativeArea
domainIncludes: DrugLegalStatus
domainIncludes: DrugCost
comment: The location in which the status applies.
isPartOf: health-lifesci.schema.org

PublicHolidays
type: DayOfWeek
comment: This stands for any day that is a public holiday; it is a placeholder for all official public holidays in some particular location. While not technically a "day of the week", it can be used with OpeningHoursSpecification. In the context of an opening hours specification it can be used to indicate opening hours on public holidays, overriding general opening hours for the day of the week on which a public holiday occurs.
contributor: good-relations-and-schema-org

eduQuestionType
type: Property
comment: For questions that are part of learning resources (e.g. Quiz), eduQuestionType indicates the format of question being given. Example: "Multiple choice", "Open ended", "Flashcard".
domainIncludes: SolveMathAction
domainIncludes: Question
rangeIncludes: Text
source: https://github.com/schemaorg/schemaorg/issues/2636
isPartOf: pending.schema.org

spouse
type: Property
comment: The person's spouse.
domainIncludes: Person
rangeIncludes: Person

risks
type: Property
isPartOf: health-lifesci.schema.org
domainIncludes: Diet
rangeIncludes: Text
comment: Specific physiologic risks associated to the diet plan.

Casino
type: Class
subclass of: EntertainmentBusiness
comment: A casino.

providesService
type: Property
comment: The service provided by this channel.
domainIncludes: ServiceChannel
rangeIncludes: Service

SequentialArt
type: Class
isPartOf: bib.schema.org
subclass of: VisualArtwork
subclass of: Book
comment: An art forms that use images deployed in a specific order for the purpose of graphic storytelling (i.e., narration of graphic stories) or conveying information. Examples of SequentialArt are Franco-Belgian Bande Dessinée, Comics in the USA and 漫画 (Manga) in Japan.

numberOfAccommodationUnits
type: Property
isPartOf: pending.schema.org
domainIncludes: ApartmentComplex
domainIncludes: FloorPlan
rangeIncludes: QuantitativeValue
source: https://github.com/schemaorg/schemaorg/issues/2373
comment: Indicates the total (available plus unavailable) number of accommodation units in an ApartmentComplex, or the number of accommodation units for a specific FloorPlan (within its specific ApartmentComplex). See also numberOfAvailableAccommodationUnits.

repetitions
type: Property
rangeIncludes: QuantitativeValue
rangeIncludes: Number
domainIncludes: ExercisePlan
comment: Number of times one should repeat the activity.
isPartOf: health-lifesci.schema.org

VenueMap
type: MapCategoryType
comment: A venue map (e.g. for malls, auditoriums, museums, etc.).

ResultsAvailable
type: MedicalStudyStatus
comment: Results are available.
isPartOf: health-lifesci.schema.org

WearableMeasurementOutsideLeg
type: WearableMeasurementTypeEnumeration
isPartOf: pending.schema.org
comment: Measurement of the outside leg, for example of pants.
source: https://github.com/schemaorg/schemaorg/issues/2811

callSign
type: Property
isPartOf: pending.schema.org
sub property of: identifier
source: https://github.com/schemaorg/schemaorg/issues/2109
domainIncludes: Person
domainIncludes: BroadcastService
domainIncludes: Vehicle
comment: A [callsign](https://en.wikipedia.org/wiki/Call_sign), as used in broadcasting and radio communications to identify people, radio and TV stations, or vehicles.
rangeIncludes: Text

bioChemInteraction
type: Property
comment: A BioChemEntity that is known to interact with this item.
domainIncludes: BioChemEntity
isPartOf: pending.schema.org
source: www.bioschemas.org
rangeIncludes: BioChemEntity

Genetic
type: MedicalSpecialty
comment: A specific branch of medical science that pertains to hereditary transmission and the variation of inherited characteristics and disorders.
isPartOf: health-lifesci.schema.org

CheckAction
type: Class
subclass of: FindAction
comment: An agent inspects, determines, investigates, inquires, or examines an object's accuracy, quality, condition, or state.

interestRate
type: Property
contributor: FIBO
comment: The interest rate, charged or paid, applicable to the financial product. Note: This is different from the calculated annualPercentageRate.
rangeIncludes: QuantitativeValue
rangeIncludes: Number
domainIncludes: FinancialProduct

hasParticipationOffer
type: Property
rangeIncludes: Offer
source: https://github.com/schemaorg/schemaorg/issues/4495
comment: An offer to participate in the event, for example, Call for Proposals, Call for Speakers, or Call for Performers.
domainIncludes: Event
isPartOf: pending.schema.org

XRay
type: MedicalImagingTechnique
isPartOf: health-lifesci.schema.org
comment: X-ray imaging.

Aquarium
type: Class
comment: Aquarium.
subclass of: CivicStructure

incomeLimit
type: Property
rangeIncludes: MonetaryAmount
rangeIncludes: Text
source: https://github.com/schemaorg/schemaorg/issues/3572
domainIncludes: FinancialIncentive
isPartOf: pending.schema.org
comment: Optional. Income limit for which the incentive is applicable for. If MonetaryAmount is specified, this should be based on annualized income (e.g. if an incentive is limited to those making <$114,000 annually): { "@type": "MonetaryAmount", "maxValue": 114000, "currency": "USD", } Use Text for incentives that are limited based on other criteria, for example if an incentive is only available to recipients making 120% of the median poverty income in their area.

discussionUrl
type: Property
rangeIncludes: URL
domainIncludes: CreativeWork
comment: A link to the page containing the comments of the CreativeWork.

DeleteAction
type: Class
comment: The act of editing a recipient by removing one of its objects.
subclass of: UpdateAction

Osteopathic
type: MedicineSystem
comment: A system of medicine focused on promoting the body's innate ability to heal itself.
isPartOf: health-lifesci.schema.org

partOfEpisode
type: Property
domainIncludes: Clip
rangeIncludes: Episode
sub property of: isPartOf
comment: The episode to which this clip belongs.

BodyMeasurementUnderbust
type: BodyMeasurementTypeEnumeration
isPartOf: pending.schema.org
source: https://github.com/schemaorg/schemaorg/issues/2811
comment: Girth of body just below the bust. Used, for example, to fit women's swimwear.

scheduleTimezone
type: Property
rangeIncludes: Text
comment: Indicates the timezone for which the time(s) indicated in the Schedule are given. The value provided should be among those listed in the IANA Time Zone Database.
source: https://github.com/schemaorg/schemaorg/issues/1457
isPartOf: pending.schema.org
domainIncludes: Schedule

restockingFee
type: Property
isPartOf: pending.schema.org
comment: Use MonetaryAmount to specify a fixed restocking fee for product returns, or use Number to specify a percentage of the product price paid by the customer.
domainIncludes: MerchantReturnPolicySeasonalOverride
domainIncludes: MerchantReturnPolicy
source: https://github.com/schemaorg/schemaorg/issues/2880
rangeIncludes: Number
rangeIncludes: MonetaryAmount

publisher
type: Property
rangeIncludes: Person
rangeIncludes: Organization
domainIncludes: FinancialIncentive
domainIncludes: CreativeWork
comment: The publisher of the article in question.

recommendedIntake
type: Property
rangeIncludes: RecommendedDoseSchedule
domainIncludes: DietarySupplement
comment: Recommended intake of this supplement for a given population as defined by a specific recommending authority.
isPartOf: health-lifesci.schema.org

handlingTime
type: Property
sub property of: duration
domainIncludes: ShippingDeliveryTime
domainIncludes: ShippingService
rangeIncludes: ServicePeriod
rangeIncludes: QuantitativeValue
source: https://github.com/schemaorg/schemaorg/issues/2506
source: https://github.com/schemaorg/schemaorg/issues/3617
comment: The typical delay between the receipt of the order and the goods either leaving the warehouse or being prepared for pickup, in case the delivery method is on site pickup. In the context of ShippingDeliveryTime, Typical properties: minValue, maxValue, unitCode (d for DAY). This is by common convention assumed to mean business days (if a unitCode is used, coded as "d"), i.e. only counting days when the business normally operates. In the context of ShippingService, use the ServicePeriod format, that contains the same information in a structured form, with cut-off time, business days and duration.

AlgorithmicMediaDigitalSource
type: IPTCDigitalSourceEnumeration
source: https://github.com/schemaorg/schemaorg/issues/3392
comment: Content coded as 'algorithmic media' using the IPTC digital source type vocabulary.
isPartOf: pending.schema.org

SpokenWordAlbum
type: MusicAlbumProductionType
contributor: MBZ
comment: SpokenWordAlbum.

Nonprofit527
type: USNonprofitType
isPartOf: pending.schema.org
source: https://github.com/schemaorg/schemaorg/issues/2543
comment: Nonprofit527: Non-profit type referring to political organizations.

Distillery
type: Class
subclass of: FoodEstablishment
comment: A distillery.
source: https://github.com/schemaorg/schemaorg/issues/743

url
type: Property
comment: URL of the item.
domainIncludes: Thing
rangeIncludes: URL

discount
type: Property
rangeIncludes: Number
rangeIncludes: Text
comment: Any discount applied (to an Order).
domainIncludes: Order

maximumEnrollment
type: Property
domainIncludes: EducationalOccupationalProgram
rangeIncludes: Integer
isPartOf: pending.schema.org
comment: The maximum number of students who may be enrolled in the program.
source: https://github.com/schemaorg/schemaorg/issues/2419

OrderPaymentDue
type: OrderStatus
comment: OrderStatus representing that payment is due on an order.

endTime
type: Property
source: https://github.com/schemaorg/schemaorg/issues/2493
domainIncludes: MediaObject
domainIncludes: InteractionCounter
domainIncludes: FoodEstablishmentReservation
domainIncludes: Action
domainIncludes: Schedule
rangeIncludes: DateTime
rangeIncludes: Time
comment: The endTime of something. For a reserved event or service (e.g. FoodEstablishmentReservation), the time that it is expected to end. For actions that span a period of time, when the action was performed. E.g. John wrote a book from January to *December*. For media, including audio and video, it's the time offset of the end of a clip within a larger file.\n\nNote that Event uses startDate/endDate instead of startTime/endTime, even when describing dates with times. This situation may be clarified in future revisions.

ResetPasswordAction
type: Class
subclass of: ControlAction
source: https://github.com/schemaorg/schemaorg/issues/4507
isPartOf: pending.schema.org
comment: The action of resetting the password of a device or application.

legislationDateVersion
type: Property
comment: The point-in-time at which the provided description of the legislation is valid (e.g.: when looking at the law on the 2016-04-07 (= dateVersion), I get the consolidation of 2015-04-12 of the "National Insurance Contributions Act 2015")
source: https://github.com/schemaorg/schemaorg/issues/1156
source: eli
rangeIncludes: Date
domainIncludes: Legislation
equivalent property: version date
contributor: ELI
isPartOf: pending.schema.org

endorsee
type: Property
comment: A sub property of participant. The person/organization being supported.
rangeIncludes: Person
rangeIncludes: Organization
sub property of: participant
domainIncludes: EndorseAction

contactlessPayment
type: Property
comment: A secure method for consumers to purchase products or services via debit, credit or smartcards by using RFID or NFC technology.
contributor: FIBO
isPartOf: pending.schema.org
rangeIncludes: Boolean
domainIncludes: PaymentCard
source: https://github.com/schemaorg/schemaorg/issues/1253

isicV4
type: Property
rangeIncludes: Text
comment: The International Standard of Industrial Classification of All Economic Activities (ISIC), Revision 4 code for a particular organization, business person, or place.
domainIncludes: Place
domainIncludes: Person
domainIncludes: Organization
contributor: GoodRelationsTerms

CommentPermission
type: DigitalDocumentPermissionType
comment: Permission to add comments to the document.

serviceLocation
type: Property
domainIncludes: ServiceChannel
rangeIncludes: Place
comment: The location (e.g. civic structure, local business, etc.) where a person can go to access the service.

employmentType
type: Property
comment: Type of employment (e.g. full-time, part-time, contract, temporary, seasonal, internship).
domainIncludes: JobPosting
rangeIncludes: Text

Beach
type: Class
comment: Beach.
subclass of: CivicStructure

currenciesAccepted
type: Property
domainIncludes: LocalBusiness
comment: The currency accepted.\n\nUse standard formats: [ISO 4217 currency format](http://en.wikipedia.org/wiki/ISO_4217), e.g. "USD"; [Ticker symbol](https://en.wikipedia.org/wiki/List_of_cryptocurrencies) for cryptocurrencies, e.g. "BTC"; well known names for [Local Exchange Trading Systems](https://en.wikipedia.org/wiki/Local_exchange_trading_system) (LETS) and other currency types, e.g. "Ithaca HOUR".
rangeIncludes: Text

numberOfEmployees
type: Property
rangeIncludes: QuantitativeValue
comment: The number of employees in an organization, e.g. business.
domainIncludes: Organization
domainIncludes: BusinessAudience

replacer
type: Property
domainIncludes: ReplaceAction
comment: A sub property of object. The object that replaces.
rangeIncludes: Thing
sub property of: object

Neuro
type: PhysicalExam
comment: Neurological system clinical examination.
isPartOf: health-lifesci.schema.org

sourcedFrom
type: Property
comment: The neurological pathway that originates the neurons.
rangeIncludes: BrainStructure
isPartOf: health-lifesci.schema.org
domainIncludes: Nerve

itemListElement
type: Property
rangeIncludes: Thing
rangeIncludes: ListItem
rangeIncludes: Text
domainIncludes: ItemList
comment: For itemListElement values, you can use simple strings (e.g. "Peter", "Paul", "Mary"), existing entities, or use ListItem.\n\nText values are best if the elements in the list are plain strings. Existing entities are best for a simple, unordered list of existing things in your data. ListItem is used with ordered lists when you want to provide additional context about the element in that list or when the same item might be in different places in different lists.\n\nNote: The order of elements in your mark-up is not sufficient for indicating the order or elements. Use ListItem with a 'position' property in such cases.

Longitudinal
type: MedicalObservationalStudyDesign
isPartOf: health-lifesci.schema.org
comment: Unlike cross-sectional studies, longitudinal studies track the same people, and therefore the differences observed in those people are less likely to be the result of cultural differences across generations. Longitudinal studies are also used in medicine to uncover predictors of certain diseases.

WeaponConsideration
type: AdultOrientedEnumeration
source: https://github.com/schemaorg/schemaorg/issues/2989
isPartOf: pending.schema.org
comment: The item is intended to induce bodily harm, for example guns, mace, combat knives, brass knuckles, nail or other bombs, and spears.

LowLactoseDiet
type: RestrictedDiet
comment: A diet appropriate for people with lactose intolerance.

Renal
type: MedicalSpecialty
isPartOf: health-lifesci.schema.org
comment: A specific branch of medical science that pertains to the study of the kidneys and its respective disease states.

boardingGroup
type: Property
comment: The airline-specific indicator of boarding order / preference.
domainIncludes: FlightReservation
rangeIncludes: Text

affiliation
type: Property
sub property of: memberOf
comment: An organization that this person is affiliated with. For example, a school/university, a club, or a team.
domainIncludes: Person
rangeIncludes: Organization

memberOf
type: Property
inverseOf: member
domainIncludes: Person
domainIncludes: Organization
rangeIncludes: ProgramMembership
rangeIncludes: Organization
rangeIncludes: MemberProgramTier
comment: An Organization (or ProgramMembership) to which this Person or Organization belongs.

duns
type: Property
sub property of: identifier
comment: The Dun & Bradstreet DUNS number for identifying an organization or business person.
domainIncludes: Person
domainIncludes: Organization
contributor: GoodRelationsTerms
equivalent property: dUNSId
rangeIncludes: Text

spokenByCharacter
type: Property
comment: The (e.g. fictional) character, Person or Organization to whom the quotation is attributed within the containing CreativeWork.
rangeIncludes: Person
rangeIncludes: Organization
isPartOf: pending.schema.org
source: https://github.com/schemaorg/schemaorg/issues/271
domainIncludes: Quotation

HowToTip
type: Class
comment: An explanation in the instructions for how to achieve a result. It provides supplementary information about a technique, supply, author's preference, etc. It can explain what could be done, or what should not be done, but doesn't specify what should be done (see HowToDirection).
subclass of: CreativeWork
subclass of: ListItem

availableChannel
type: Property
domainIncludes: Service
rangeIncludes: ServiceChannel
comment: A means of accessing the service (e.g. a phone bank, a web site, a location, etc.).

SoldOut
type: ItemAvailability
comment: Indicates that the item has sold out.

membershipNumber
type: Property
domainIncludes: ProgramMembership
comment: A unique identifier for the membership.
rangeIncludes: Text

PerformingArtsEvent
type: Class
comment: Live performance Event of the performing arts (music, theatre, dance, acrobatics, spoken word), including performance art and performative sports (e.g. choreographed forms of martial arts, figure skating, competitive ballroom dancing). Note: Use additionalType to differentiate between productions / shows (PerformanceWork, EventSeries), tours (EventSeries), and individual performances.
equivalent class: F31 Performance
subclass of: Event
source: https://github.com/schemaorg/schemaorg/issues/4468
isPartOf: pending.schema.org

TreatmentsHealthAspect
type: HealthAspectEnumeration
source: https://github.com/schemaorg/schemaorg/issues/2374
isPartOf: pending.schema.org
comment: Treatments or related therapies for a Topic.

recipeCuisine
type: Property
rangeIncludes: Text
domainIncludes: Recipe
comment: The cuisine of the recipe (for example, French or Ethiopian).

ineligibleRegion
type: Property
rangeIncludes: GeoShape
rangeIncludes: Text
rangeIncludes: Place
comment: The ISO 3166-1 (ISO 3166-1 alpha-2) or ISO 3166-2 code, the place, or the GeoShape for the geo-political region(s) for which the offer or delivery charge specification is not valid, e.g. a region where the transaction is not allowed.\n\nSee also eligibleRegion.
source: https://github.com/schemaorg/schemaorg/issues/2242
isPartOf: pending.schema.org
domainIncludes: MediaObject
domainIncludes: Demand
domainIncludes: ActionAccessSpecification
domainIncludes: Offer
domainIncludes: DeliveryChargeSpecification

alternativeOf
type: Property
source: Gene
rangeIncludes: Gene
comment: Another gene which is a variation of this one.
isPartOf: pending.schema.org
domainIncludes: Gene

naics
type: Property
rangeIncludes: Text
domainIncludes: Person
domainIncludes: Organization
comment: The North American Industry Classification System (NAICS) code for a particular organization or business person.
sub property of: isClassifiedBy
contributor: GoodRelationsTerms

ownedThrough
type: Property
comment: The date and time of giving up ownership on the product.
rangeIncludes: DateTime
contributor: GoodRelationsTerms
domainIncludes: OwnershipInfo

MovieClip
type: Class
comment: A short segment/part of a movie.
subclass of: Clip

fulfillmentType
type: Property
rangeIncludes: FulfillmentTypeEnumeration
domainIncludes: ShippingService
isPartOf: pending.schema.org
comment: Type of fulfillment applicable to the ShippingService.
source: https://github.com/schemaorg/schemaorg/issues/3617

PrintDigitalSource
type: IPTCDigitalSourceEnumeration
comment: Content coded as 'print' using the IPTC digital source type vocabulary.
source: https://github.com/schemaorg/schemaorg/issues/3392
isPartOf: pending.schema.org

familyName
type: Property
domainIncludes: Person
rangeIncludes: Text
comment: Family name. In the U.S., the last name of a Person.

numberOfBathroomsTotal
type: Property
comment: The total integer number of bathrooms in some Accommodation, following real estate conventions as [documented in RESO](https://ddwiki.reso.org/display/DDW17/BathroomsTotalInteger+Field): "The simple sum of the number of bathrooms. For example for a property with two Full Bathrooms and one Half Bathroom, the Bathrooms Total Integer will be 3.". See also numberOfRooms.
source: https://github.com/schemaorg/schemaorg/issues/2373
domainIncludes: FloorPlan
domainIncludes: Accommodation
rangeIncludes: Integer
isPartOf: pending.schema.org

offerCount
type: Property
domainIncludes: AggregateOffer
rangeIncludes: Integer
comment: The number of offers for the product.

billingAddress
type: Property
domainIncludes: Order
rangeIncludes: PostalAddress
equivalent property: BillingAddress
comment: The billing address for the order.

MerchantReturnFiniteReturnWindow
type: MerchantReturnEnumeration
comment: Specifies that there is a finite window for product returns.
isPartOf: pending.schema.org
source: https://github.com/schemaorg/schemaorg/issues/2288

shippingRate
type: Property
rangeIncludes: MonetaryAmount
rangeIncludes: ShippingRateSettings
domainIncludes: ShippingRateSettings
domainIncludes: OfferShippingDetails
domainIncludes: ShippingConditions
source: https://github.com/schemaorg/schemaorg/issues/2506
source: https://github.com/schemaorg/schemaorg/issues/3617
comment: The shipping rate is the cost of shipping to the specified destination. Typically, the maxValue and currency values (of the MonetaryAmount) are most appropriate.

DislikeAction
type: Class
comment: The act of expressing a negative sentiment about the object. An agent dislikes an object (a proposition, topic or theme) with participants.
subclass of: ReactAction

highPrice
type: Property
rangeIncludes: Number
rangeIncludes: Text
domainIncludes: AggregateOffer
comment: The highest price of all offers available.\n\nUsage guidelines:\n\n* Use values from 0123456789 (Unicode 'DIGIT ZERO' (U+0030) to 'DIGIT NINE' (U+0039)) rather than superficially similar Unicode symbols.\n* Use '.' (Unicode 'FULL STOP' (U+002E)) rather than ',' to indicate a decimal point. Avoid using these symbols as a readability separator.

WearableSizeSystemMX
type: WearableSizeSystemEnumeration
comment: Mexican size system for wearables.
source: https://github.com/schemaorg/schemaorg/issues/2811
isPartOf: pending.schema.org

incentiveStatus
type: Property
domainIncludes: FinancialIncentive
rangeIncludes: IncentiveStatus
source: https://github.com/schemaorg/schemaorg/issues/3572
comment: The status of the incentive (active, on hold, retired, etc.).
isPartOf: pending.schema.org

numberOfRooms
type: Property
domainIncludes: SingleFamilyResidence
domainIncludes: Apartment
domainIncludes: LodgingBusiness
domainIncludes: Accommodation
domainIncludes: Suite
domainIncludes: FloorPlan
domainIncludes: House
rangeIncludes: QuantitativeValue
rangeIncludes: Number
contributor: STI Accommodation Ontology
comment: The number of rooms (excluding bathrooms and closets) of the accommodation or lodging business. Typical unit code(s): ROM for room or C62 for no unit. The type of room can be put in the unitText property of the QuantitativeValue.

prepTime
type: Property
domainIncludes: HowTo
domainIncludes: HowToDirection
comment: The length of time it takes to prepare the items to be used in instructions or a direction, in [ISO 8601 duration format](http://en.wikipedia.org/wiki/ISO_8601).
rangeIncludes: Duration

sourceOrganization
type: Property
domainIncludes: CreativeWork
rangeIncludes: Organization
comment: The Organization on whose behalf the creator was working.

ProfilePage
type: Class
comment: Web page type: Profile page.
subclass of: WebPage

InForce
type: LegalForceStatus
source: https://github.com/schemaorg/schemaorg/issues/1156
source: eli
contributor: ELI
isPartOf: pending.schema.org
comment: Indicates that a legislation is in force.

accommodationFloorPlan
type: Property
comment: A floorplan of some Accommodation.
rangeIncludes: FloorPlan
isPartOf: pending.schema.org
domainIncludes: Accommodation
domainIncludes: Residence
source: https://github.com/schemaorg/schemaorg/issues/2373

EUEnergyEfficiencyCategoryA2Plus
type: EUEnergyEfficiencyEnumeration
source: https://github.com/schemaorg/schemaorg/issues/2670
comment: Represents EU Energy Efficiency Class A++ as defined in EU energy labeling regulations.
isPartOf: pending.schema.org

reviews
type: Property
domainIncludes: Product
domainIncludes: Place
domainIncludes: CreativeWork
domainIncludes: Offer
domainIncludes: Organization
comment: Review of the item.
supersededBy: review
rangeIncludes: Review

review
type: Property
domainIncludes: CreativeWork
domainIncludes: Service
domainIncludes: Offer
domainIncludes: Organization
domainIncludes: Brand
domainIncludes: Product
domainIncludes: Event
domainIncludes: Place
rangeIncludes: Review
comment: A review of the item.

gameItem
type: Property
rangeIncludes: Thing
comment: An item is an object within the game world that can be collected by a player or, occasionally, a non-player character.
domainIncludes: Game
domainIncludes: VideoGameSeries

FMRadioChannel
type: Class
subclass of: RadioChannel
source: https://github.com/schemaorg/schemaorg/issues/1004
comment: A radio channel that uses FM.

FullRefund
type: RefundTypeEnumeration
isPartOf: pending.schema.org
comment: Specifies that a refund can be done in the full amount the customer paid for the product.
source: https://github.com/schemaorg/schemaorg/issues/2288

ingredients
type: Property
comment: A single ingredient used in the recipe, e.g. sugar, flour or garlic.
rangeIncludes: Text
supersededBy: recipeIngredient
domainIncludes: Recipe
sub property of: supply

recipeIngredient
type: Property
comment: An ingredient or ordered list of ingredients and potentially quantities used in the recipe, e.g. 1 cup of sugar, flour or garlic. The ingredients can be represented as free text or more structured values.
rangeIncludes: ItemList
rangeIncludes: PropertyValue
rangeIncludes: Text
domainIncludes: Recipe
sub property of: supply

supply
type: Property
domainIncludes: HowTo
domainIncludes: HowToDirection
comment: A sub-property of instrument. A supply consumed when performing instructions or a direction.
rangeIncludes: Text
rangeIncludes: HowToSupply
sub property of: instrument

diagram
type: Property
rangeIncludes: ImageObject
comment: An image containing a diagram that illustrates the structure and/or its component substructures and/or connections with other structures.
isPartOf: health-lifesci.schema.org
domainIncludes: AnatomicalStructure

diseaseSpreadStatistics
type: Property
rangeIncludes: Dataset
rangeIncludes: URL
rangeIncludes: WebContent
rangeIncludes: Observation
isPartOf: pending.schema.org
source: https://github.com/schemaorg/schemaorg/issues/2490
comment: Statistical information about the spread of a disease, either as WebContent, or described directly as a Dataset, or the specific Observations in the dataset. When a WebContent URL is provided, the page indicated might also contain more such markup.
domainIncludes: SpecialAnnouncement

loanPaymentFrequency
type: Property
source: https://github.com/schemaorg/schemaorg/issues/1253
comment: Frequency of payments due, i.e. number of months between payments. This is defined as a frequency, i.e. the reciprocal of a period of time.
rangeIncludes: Number
domainIncludes: RepaymentSpecification
contributor: FIBO
isPartOf: pending.schema.org

SymptomsHealthAspect
type: HealthAspectEnumeration
isPartOf: pending.schema.org
source: https://github.com/schemaorg/schemaorg/issues/2374
comment: Symptoms or related symptoms of a Topic.

recipe
type: Property
rangeIncludes: Recipe
sub property of: instrument
domainIncludes: CookAction
comment: A sub property of instrument. The recipe/instructions used to perform the action.

publication
type: Property
comment: A publication event associated with the item.
rangeIncludes: PublicationEvent
domainIncludes: CreativeWork

datasetTimeInterval
type: Property
rangeIncludes: DateTime
supersededBy: temporalCoverage
comment: The range of temporal applicability of a dataset, e.g. for a 2011 census dataset, the year 2011 (in ISO 8601 time interval format).
domainIncludes: Dataset

temporalCoverage
type: Property
rangeIncludes: DateTime
rangeIncludes: URL
rangeIncludes: Text
comment: The temporalCoverage of a CreativeWork indicates the period that the content applies to, i.e. that it describes, either as a DateTime or as a textual string indicating a time period in [ISO 8601 time interval format](https://en.wikipedia.org/wiki/ISO_8601#Time_intervals). In the case of a Dataset it will typically indicate the relevant time period in a precise notation (e.g. for a 2011 census dataset, the year 2011 would be written "2011/2012"). Other forms of content, e.g. ScholarlyArticle, Book, TVSeries or TVEpisode, may indicate their temporalCoverage in broader terms - textually or via well-known URL. Written works such as books may sometimes have precise temporal coverage too, e.g. a work set in 1939 - 1945 can be indicated in ISO 8601 interval format format via "1939/1945". Open-ended date ranges can be written with ".." in place of the end date. For example, "2015-11/.." indicates a range beginning in November 2015 and with no specified final date. This is tentative and might be updated in future when ISO 8601 is officially updated.
equivalent property: temporal
domainIncludes: CreativeWork

followee
type: Property
rangeIncludes: Person
rangeIncludes: Organization
sub property of: object
comment: A sub property of object. The person or organization being followed.
domainIncludes: FollowAction

DiscussionForumPosting
type: Class
comment: A posting to a discussion forum.
subclass of: SocialMediaPosting

Optometric
type: MedicalSpecialty
isPartOf: health-lifesci.schema.org
comment: The science or practice of testing visual acuity and prescribing corrective lenses.
subclass of: MedicalBusiness

WPHeader
type: Class
subclass of: WebPageElement
comment: The header section of the page.

ParcelService
type: DeliveryMethod
contributor: good-relations-and-schema-org
comment: A private parcel service as the delivery mode available for a certain offer.\n\nCommonly used values:\n\n* http://purl.org/goodrelations/v1#DHL\n* http://purl.org/goodrelations/v1#FederalExpress\n* http://purl.org/goodrelations/v1#UPS

errorCode
type: Property
rangeIncludes: Text
rangeIncludes: Integer
rangeIncludes: DefinedTerm
rangeIncludes: StatusEnumeration
comment: Application or platform dependant error code.
domainIncludes: Error

tocContinuation
type: Property
rangeIncludes: HyperTocEntry
comment: A HyperTocEntry can have a tocContinuation indicated, which is another HyperTocEntry that would be the default next item to play or render.
source: https://github.com/schemaorg/schemaorg/issues/2766
isPartOf: pending.schema.org
domainIncludes: HyperTocEntry

checkinTime
type: Property
domainIncludes: LodgingBusiness
domainIncludes: LodgingReservation
rangeIncludes: DateTime
rangeIncludes: Time
comment: The earliest someone may check into a lodging establishment.

partOfSystem
type: Property
isPartOf: health-lifesci.schema.org
rangeIncludes: AnatomicalSystem
comment: The anatomical or organ system that this structure is part of.
domainIncludes: AnatomicalStructure

phoneticText
type: Property
rangeIncludes: Text
source: https://github.com/schemaorg/schemaorg/issues/2108
isPartOf: pending.schema.org
comment: Representation of a text textValue using the specified speechToTextMarkup. For example the city name of Houston in IPA: /ˈhjuːstən/.
domainIncludes: PronounceableText

directApply
type: Property
source: https://github.com/schemaorg/schemaorg/issues/2907
domainIncludes: JobPosting
isPartOf: pending.schema.org
rangeIncludes: Boolean
comment: Indicates whether an url that is associated with a JobPosting enables direct application for the job, via the posting website. A job posting is considered to have directApply of True if an application process for the specified job can be directly initiated via the url(s) given (noting that e.g. multiple internet domains might nevertheless be involved at an implementation level). A value of False is appropriate if there is no clear path to applying directly online for the specified job, navigating directly from the JobPosting url(s) supplied.

comment
type: Property
domainIncludes: RsvpAction
domainIncludes: CreativeWork
comment: Comments, typically from users.
rangeIncludes: Comment

HardwareStore
type: Class
comment: A hardware store.
subclass of: Store

vehicleInteriorColor
type: Property
contributor: Automotive Ontology Working Group
comment: The color or color combination of the interior of the vehicle.
rangeIncludes: Text
domainIncludes: Vehicle

Volcano
type: Class
comment: A volcano, like Fujisan.
subclass of: Landform

Female
type: GenderType
comment: The female gender.

followup
type: Property
comment: Typical or recommended followup care after the procedure is performed.
isPartOf: health-lifesci.schema.org
domainIncludes: MedicalProcedure
rangeIncludes: Text

EvidenceLevelC
type: MedicalEvidenceLevel
comment: Only consensus opinion of experts, case studies, or standard-of-care.
isPartOf: health-lifesci.schema.org

availableIn
type: Property
comment: The location in which the strength is available.
isPartOf: health-lifesci.schema.org
rangeIncludes: AdministrativeArea
domainIncludes: DrugStrength

gender
type: Property
domainIncludes: SportsTeam
domainIncludes: Person
isPartOf: pending.schema.org
rangeIncludes: Text
rangeIncludes: GenderType
source: https://github.com/schemaorg/schemaorg/issues/2341
comment: Gender of something, typically a Person, but possibly also fictional characters, animals, etc. While http://schema.org/Male and http://schema.org/Female may be used, text strings are also acceptable for people who are not a binary gender. The gender property can also be used in an extended sense to cover e.g. the gender of sports teams. As with the gender of individuals, we do not try to enumerate all possibilities. A mixed-gender SportsTeam can be indicated with a text value of "Mixed".

copyrightYear
type: Property
rangeIncludes: Number
domainIncludes: CreativeWork
comment: The year during which the claimed copyright for the CreativeWork was first asserted.

PurchaseTypeTradeIn
type: PurchaseType
isPartOf: pending.schema.org
source: https://github.com/schemaorg/schemaorg/issues/3572
comment: This is a trade-in for an item.

WearableSizeGroupBig
type: WearableSizeGroupEnumeration
isPartOf: pending.schema.org
comment: Size group "Big" for wearables.
source: https://github.com/schemaorg/schemaorg/issues/2811

passengerSequenceNumber
type: Property
domainIncludes: FlightReservation
rangeIncludes: Text
comment: The passenger's sequence number as assigned by the airline.

recordLabel
type: Property
rangeIncludes: Organization
domainIncludes: MusicRelease
equivalent property: label
contributor: MBZ
comment: The label that issued the release.

passengerPriorityStatus
type: Property
domainIncludes: FlightReservation
rangeIncludes: Text
rangeIncludes: QualitativeValue
comment: The priority status assigned to a passenger for security or boarding (e.g. FastTrack or Priority).

InvestmentFund
type: Class
source: https://github.com/schemaorg/schemaorg/issues/1253
comment: A company or fund that gathers capital from a number of investors to create a pool of money that is then re-invested into stocks, bonds and other assets.
subclass of: InvestmentOrDeposit
contributor: FIBO
isPartOf: pending.schema.org

seriousAdverseOutcome
type: Property
rangeIncludes: MedicalEntity
domainIncludes: MedicalDevice
domainIncludes: MedicalTherapy
comment: A possible serious complication and/or serious side effect of this therapy. Serious adverse outcomes include those that are life-threatening; result in death, disability, or permanent damage; require hospitalization or prolong existing hospitalization; cause congenital anomalies or birth defects; or jeopardize the patient and may require medical or surgical intervention to prevent one of the outcomes in this definition.
isPartOf: health-lifesci.schema.org

availableAtOrFrom
type: Property
domainIncludes: Demand
domainIncludes: Offer
comment: The place(s) from which the offer can be obtained (e.g. store locations).
rangeIncludes: Place
contributor: GoodRelationsTerms
sub property of: areaServed

BusinessEvent
type: Class
subclass of: Event
comment: Event type: Business event.

cookTime
type: Property
sub property of: performTime
comment: The time it takes to actually cook the dish, in [ISO 8601 duration format](http://en.wikipedia.org/wiki/ISO_8601).
domainIncludes: Recipe
rangeIncludes: Duration

performTime
type: Property
domainIncludes: HowToDirection
domainIncludes: HowTo
comment: The length of time it takes to perform instructions or a direction (not including time to prepare the supplies), in [ISO 8601 duration format](http://en.wikipedia.org/wiki/ISO_8601).
rangeIncludes: Duration

Nonprofit501c14
type: USNonprofitType
isPartOf: pending.schema.org
comment: Nonprofit501c14: Non-profit type referring to State-Chartered Credit Unions, Mutual Reserve Funds.
source: https://github.com/schemaorg/schemaorg/issues/2543

NotYetRecruiting
type: MedicalStudyStatus
comment: Not yet recruiting.
isPartOf: health-lifesci.schema.org

Manuscript
type: Class
isPartOf: pending.schema.org
comment: A book, document, or piece of music written by hand rather than typed or printed.
source: https://github.com/schemaorg/schemaorg/issues/1448
subclass of: CreativeWork

StadiumOrArena
type: Class
subclass of: CivicStructure
subclass of: SportsActivityLocation
comment: A stadium.

CompositeWithTrainedAlgorithmicMediaDigitalSource
type: IPTCDigitalSourceEnumeration
isPartOf: pending.schema.org
comment: Content coded as 'composite with trained algorithmic media' using the IPTC digital source type vocabulary.
source: https://github.com/schemaorg/schemaorg/issues/3392

numberOfLoanPayments
type: Property
source: https://github.com/schemaorg/schemaorg/issues/1253
rangeIncludes: Number
domainIncludes: RepaymentSpecification
comment: The number of payments contractually required at origination to repay the loan. For monthly paying loans this is the number of months from the contractual first payment date to the maturity date.
contributor: FIBO
isPartOf: pending.schema.org

sdLicense
type: Property
comment: A license document that applies to this structured data, typically indicated by URL.
source: https://github.com/schemaorg/schemaorg/issues/1886
rangeIncludes: CreativeWork
rangeIncludes: URL
domainIncludes: CreativeWork
isPartOf: pending.schema.org

ReturnShippingFees
type: ReturnFeesEnumeration
comment: Specifies that the customer must pay the return shipping costs when returning a product.
isPartOf: pending.schema.org
source: https://github.com/schemaorg/schemaorg/issues/2288

TieAction
type: Class
subclass of: AchieveAction
comment: The act of reaching a draw in a competitive activity.

boardingPolicy
type: Property
rangeIncludes: BoardingPolicyType
domainIncludes: Airline
domainIncludes: Flight
comment: The type of boarding policy used by the airline (e.g. zone-based or group-based).

maximumIntake
type: Property
comment: Recommended intake of this supplement for a given population as defined by a specific recommending authority.
isPartOf: health-lifesci.schema.org
domainIncludes: Substance
domainIncludes: DietarySupplement
domainIncludes: DrugStrength
domainIncludes: Drug
rangeIncludes: MaximumDoseSchedule

EvidenceLevelB
type: MedicalEvidenceLevel
isPartOf: health-lifesci.schema.org
comment: Data derived from a single randomized trial, or nonrandomized studies.

messageAttachment
type: Property
domainIncludes: Message
rangeIncludes: CreativeWork
comment: A CreativeWork attached to the message.

postOfficeBoxNumber
type: Property
equivalent property: postOfficeBox
comment: The post office box number for PO box addresses.
rangeIncludes: Text
domainIncludes: PostalAddress

arrivalTerminal
type: Property
rangeIncludes: Text
comment: Identifier of the flight's arrival terminal.
domainIncludes: Flight

Electrician
type: Class
comment: An electrician.
subclass of: HomeAndConstructionBusiness

knownVehicleDamages
type: Property
contributor: Automotive Ontology Working Group
domainIncludes: Vehicle
comment: A textual description of known damages, both repaired and unrepaired.
rangeIncludes: Text

PsychologicalTreatment
type: Class
subclass of: TherapeuticProcedure
comment: A process of care relying upon counseling, dialogue and communication aimed at improving a mental health condition without use of drugs.
isPartOf: health-lifesci.schema.org

connectedTo
type: Property
comment: Other anatomical structures to which this structure is connected.
rangeIncludes: AnatomicalStructure
isPartOf: health-lifesci.schema.org
domainIncludes: AnatomicalStructure

WPFooter
type: Class
comment: The footer section of the page.
subclass of: WebPageElement

ChildCare
type: Class
comment: A Childcare center.
subclass of: LocalBusiness

flightDistance
type: Property
rangeIncludes: Distance
rangeIncludes: Text
domainIncludes: Flight
comment: The distance of the flight.

potentialUse
type: Property
isPartOf: pending.schema.org
domainIncludes: ChemicalSubstance
domainIncludes: MolecularEntity
comment: Intended use of the BioChemEntity by humans.
rangeIncludes: DefinedTerm
source: ChemicalSubstance

Sculpture
type: Class
subclass of: CreativeWork
comment: A piece of sculpture.

guidelineSubject
type: Property
comment: The medical conditions, treatments, etc. that are the subject of the guideline.
rangeIncludes: MedicalEntity
isPartOf: health-lifesci.schema.org
domainIncludes: MedicalGuideline

VeganDiet
type: RestrictedDiet
comment: A diet exclusive of all animal products.

primaryPrevention
type: Property
domainIncludes: MedicalCondition
isPartOf: health-lifesci.schema.org
rangeIncludes: MedicalTherapy
comment: A preventative therapy used to prevent an initial occurrence of the medical condition, such as vaccination.

WantAction
type: Class
comment: The act of expressing a desire about the object. An agent wants an object.
subclass of: ReactAction

streetAddress
type: Property
rangeIncludes: Text
domainIncludes: PostalAddress
comment: The street address. For example, 1600 Amphitheatre Pkwy.

labelDetails
type: Property
isPartOf: health-lifesci.schema.org
rangeIncludes: URL
domainIncludes: Drug
comment: Link to the drug's label details.

earlyPrepaymentPenalty
type: Property
source: https://github.com/schemaorg/schemaorg/issues/1253
domainIncludes: RepaymentSpecification
rangeIncludes: MonetaryAmount
comment: The amount to be paid as a penalty in the event of early payment of the loan.
contributor: FIBO
isPartOf: pending.schema.org

pronouns
type: Property
domainIncludes: Person
source: https://github.com/schemaorg/schemaorg/issues/2935
rangeIncludes: Text
rangeIncludes: StructuredValue
rangeIncludes: DefinedTerm
comment: A short string listing or describing pronouns for a person. Typically the person concerned is the best authority as pronouns are a critical part of personal identity and expression. Publishers and consumers of this information are reminded to treat this data responsibly, take country-specific laws related to gender expression into account, and be wary of out-of-date data and drawing unwarranted inferences about the person being described. In English, formulations such as "they/them", "she/her", and "he/him" are commonly used online and can also be used here. We do not intend to enumerate all possible micro-syntaxes in all languages. More structured and well-defined external values for pronouns can be referenced using the StructuredValue or DefinedTerm values.
isPartOf: pending.schema.org

AgreeAction
type: Class
comment: The act of expressing a consistency of opinion with the object. An agent agrees to/about an object (a proposition, topic or theme) with participants.
subclass of: ReactAction

emissionsCO2
type: Property
contributor: Automotive Ontology Working Group
rangeIncludes: Number
domainIncludes: Vehicle
isPartOf: auto.schema.org
comment: The CO2 emissions in g/km. When used in combination with a QuantitativeValue, put "g/km" into the unitText property of that value, since there is no UN/CEFACT Common Code for "g/km".

AudioObjectSnapshot
type: Class
source: https://github.com/schemaorg/schemaorg/issues/2450
subclass of: AudioObject
isPartOf: pending.schema.org
comment: A specific and exact (byte-for-byte) version of an AudioObject. Two byte-for-byte identical files, for the purposes of this type, considered identical. If they have different embedded metadata the files will differ. Different external facts about the files, e.g. creator or dateCreated that aren't represented in their actual content, do not affect this notion of identity.

producer
type: Property
domainIncludes: CreativeWork
comment: The person or organization who produced the work (e.g. music album, movie, TV/radio series etc.).
rangeIncludes: Person
rangeIncludes: Organization

ownershipFundingInfo
type: Property
rangeIncludes: CreativeWork
rangeIncludes: URL
rangeIncludes: AboutPage
rangeIncludes: Text
isPartOf: pending.schema.org
domainIncludes: Organization
domainIncludes: NewsMediaOrganization
source: https://github.com/schemaorg/schemaorg/issues/1525
contributor: TP
comment: For an Organization (often but not necessarily a NewsMediaOrganization), a description of organizational ownership structure; funding and grants. In a news/media setting, this is with particular reference to editorial independence. Note that the funder is also available and can be used to make basic funder information machine-readable.
sub property of: publishingPrinciples

CompilationAlbum
type: MusicAlbumProductionType
comment: CompilationAlbum.
contributor: MBZ

totalPaymentDue
type: Property
comment: The total amount due.
rangeIncludes: PriceSpecification
rangeIncludes: MonetaryAmount
domainIncludes: Invoice

BodyMeasurementArm
type: BodyMeasurementTypeEnumeration
isPartOf: pending.schema.org
comment: Arm length (measured between arms/shoulder line intersection and the prominent wrist bone). Used, for example, to fit shirts.
source: https://github.com/schemaorg/schemaorg/issues/2811

rangeIncludes
type: Property
rangeIncludes: Class
isPartOf: meta.schema.org
comment: Relates a property to a class that constitutes (one of) the expected type(s) for values of the property.
domainIncludes: Property

InsuranceAgency
type: Class
subclass of: FinancialService
comment: An Insurance agency.

issueNumber
type: Property
domainIncludes: PublicationIssue
contributor: bibex
equivalent property: issue
sub property of: position
rangeIncludes: Text
rangeIncludes: Integer
comment: Identifies the issue of publication; for example, "iii" or "2".

amount
type: Property
domainIncludes: MonetaryGrant
domainIncludes: InvestmentOrDeposit
domainIncludes: DatedMoneySpecification
domainIncludes: MoneyTransfer
domainIncludes: LoanOrCredit
source: https://github.com/schemaorg/schemaorg/issues/1253
source: https://github.com/schemaorg/schemaorg/issues/1698
rangeIncludes: Number
rangeIncludes: MonetaryAmount
comment: The amount of money.

stepValue
type: Property
rangeIncludes: Number
domainIncludes: PropertyValueSpecification
comment: The stepValue attribute indicates the granularity that is expected (and required) of the value in a PropertyValueSpecification.

Diagnostic
type: MedicalDevicePurpose
isPartOf: health-lifesci.schema.org
comment: A medical device used for diagnostic purposes.

Withdrawn
type: MedicalStudyStatus
comment: Withdrawn.
isPartOf: health-lifesci.schema.org

domainIncludes
type: Property
comment: Relates a property to a class that is (one of) the type(s) the property is expected to be used on.
rangeIncludes: Class
isPartOf: meta.schema.org
domainIncludes: Property

DrinkAction
type: Class
subclass of: ConsumeAction
comment: The act of swallowing liquids.

FireStation
type: Class
comment: A fire station. With firemen.
subclass of: CivicStructure
subclass of: EmergencyService

Endocrine
type: MedicalSpecialty
isPartOf: health-lifesci.schema.org
comment: A specific branch of medical science that pertains to diagnosis and treatment of disorders of endocrine glands and their secretions.

PresentationDigitalDocument
type: Class
subclass of: DigitalDocument
comment: A file containing slides or used for a presentation.

area
type: Property
domainIncludes: BroadcastService
comment: The area within which users can expect to reach the broadcast service.
supersededBy: serviceArea
rangeIncludes: Place

serviceArea
type: Property
domainIncludes: Organization
domainIncludes: ContactPoint
domainIncludes: Service
rangeIncludes: AdministrativeArea
rangeIncludes: GeoShape
rangeIncludes: Place
supersededBy: areaServed
comment: The geographic area where the service is provided.

HinduTemple
type: Class
comment: A Hindu temple.
subclass of: PlaceOfWorship

OrderPickupAvailable
type: OrderStatus
comment: OrderStatus representing availability of an order for pickup.

seatRow
type: Property
comment: The row location of the reserved seat (e.g., B).
rangeIncludes: Text
domainIncludes: Seat

WearableSizeGroupExtraTall
type: WearableSizeGroupEnumeration
comment: Size group "Extra Tall" for wearables.
isPartOf: pending.schema.org
source: https://github.com/schemaorg/schemaorg/issues/2811

publishedOn
type: Property
comment: A broadcast service associated with the publication event.
rangeIncludes: BroadcastService
domainIncludes: PublicationEvent

referencesOrder
type: Property
domainIncludes: Invoice
comment: The Order(s) related to this Invoice. One or more Orders may be combined into a single Invoice.
rangeIncludes: Order

TextDigitalDocument
type: Class
subclass of: DigitalDocument
comment: A file composed primarily of text.

referee
type: Property
domainIncludes: SportsEvent
comment: An official who watches a game or match closely to enforce the rules and arbitrate on matters arising from the play such as referees, umpires or judges. The name of the effective function can vary according to the sport.
rangeIncludes: Person

postalCodePrefix
type: Property
domainIncludes: DefinedRegion
comment: A defined range of postal codes indicated by a common textual prefix. Used for non-numeric systems such as UK.
source: https://github.com/schemaorg/schemaorg/issues/2506
rangeIncludes: Text

RsvpResponseNo
type: RsvpResponseType
comment: The invitee will not attend.

imagingTechnique
type: Property
rangeIncludes: MedicalImagingTechnique
comment: Imaging technique used.
isPartOf: health-lifesci.schema.org
domainIncludes: ImagingTest

artist
type: Property
rangeIncludes: Person
domainIncludes: VisualArtwork
domainIncludes: ComicStory
domainIncludes: ComicIssue
comment: The primary artist for a work in a medium other than pencils or digital line art--for example, if the primary artwork is done in watercolors or digital paints.
isPartOf: bib.schema.org

HowOrWhereHealthAspect
type: HealthAspectEnumeration
comment: Information about how or where to find a topic. Also may contain location data that can be used for where to look for help if the topic is observed.
isPartOf: pending.schema.org
source: https://github.com/schemaorg/schemaorg/issues/2374

energyEfficiencyScaleMin
type: Property
comment: Specifies the least energy efficient class on the regulated EU energy consumption scale for the product category a product belongs to. For example, energy consumption for televisions placed on the market after January 1, 2020 is scaled from D to A+++.
isPartOf: pending.schema.org
source: https://github.com/schemaorg/schemaorg/issues/2670
domainIncludes: EnergyConsumptionDetails
rangeIncludes: EUEnergyEfficiencyEnumeration

temporal
type: Property
domainIncludes: CreativeWork
rangeIncludes: Text
rangeIncludes: DateTime
comment: The "temporal" property can be used in cases where more specific properties (e.g. temporalCoverage, dateCreated, dateModified, datePublished) are not known to be appropriate.

Gastroenterologic
type: MedicalSpecialty
isPartOf: health-lifesci.schema.org
comment: A specific branch of medical science that pertains to diagnosis and treatment of disorders of digestive system.

additionalVariable
type: Property
rangeIncludes: Text
comment: Any additional component of the exercise prescription that may need to be articulated to the patient. This may include the order of exercises, the number of repetitions of movement, quantitative distance, progressions over time, etc.
isPartOf: health-lifesci.schema.org
domainIncludes: ExercisePlan

legislationAmends
type: Property
source: eli
source: https://github.com/schemaorg/schemaorg/issues/2698
contributor: ELI
rangeIncludes: Legislation
isPartOf: pending.schema.org
comment: Another legislation that this legislation amends, introducing legal changes.
sub property of: legislationChanges
domainIncludes: Legislation
equivalent property: amends

CheckOutAction
type: Class
comment: The act of an agent communicating (service provider, social media, etc) their departure of a previously reserved service (e.g. flight check-in) or place (e.g. hotel).\n\nRelated actions:\n\n* CheckInAction: The antonym of CheckOutAction.\n* DepartAction: Unlike DepartAction, CheckOutAction implies that the agent is informing/confirming the end of a previously reserved service.\n* CancelAction: Unlike CancelAction, CheckOutAction implies that the agent is informing/confirming the end of a previously reserved service.
subclass of: CommunicateAction

AccountingService
type: Class
comment: Accountancy business.\n\nAs a LocalBusiness it can be described as a provider of one or more Service\(s).
subclass of: FinancialService

MusculoskeletalExam
type: PhysicalExam
isPartOf: health-lifesci.schema.org
comment: Musculoskeletal system clinical examination.

VideoGameClip
type: Class
comment: A short segment/part of a video game.
subclass of: Clip

Nonprofit501c1
type: USNonprofitType
comment: Nonprofit501c1: Non-profit type referring to Corporations Organized Under Act of Congress, including Federal Credit Unions and National Farm Loan Associations.
isPartOf: pending.schema.org
source: https://github.com/schemaorg/schemaorg/issues/2543

RentalVehicleUsage
type: CarUsageType
contributor: Automotive Ontology Working Group
comment: Indicates the usage of the vehicle as a rental car.
isPartOf: auto.schema.org

PreventionHealthAspect
type: HealthAspectEnumeration
isPartOf: pending.schema.org
source: https://github.com/schemaorg/schemaorg/issues/2374
comment: Information about actions or measures that can be taken to avoid getting the topic or reaching a critical situation related to the topic.

BoatReservation
type: Class
comment: A reservation for boat travel. Note: This type is for information about actual reservations, e.g. in confirmation emails or HTML pages with individual confirmations of reservations. For offers of tickets, use Offer.
isPartOf: pending.schema.org
source: https://github.com/schemaorg/schemaorg/issues/1755
subclass of: Reservation

QuoteAction
type: Class
comment: An agent quotes/estimates/appraises an object/product/service with a price at a location/store.
subclass of: TradeAction

biomechnicalClass
type: Property
isPartOf: health-lifesci.schema.org
comment: The biomechanical properties of the bone.
rangeIncludes: Text
domainIncludes: Joint

doorTime
type: Property
rangeIncludes: Time
rangeIncludes: DateTime
domainIncludes: Event
comment: The time admission will commence.

attendees
type: Property
supersededBy: attendee
comment: A person attending the event.
rangeIncludes: Person
rangeIncludes: Organization
domainIncludes: Event

attendee
type: Property
domainIncludes: Event
rangeIncludes: Person
rangeIncludes: Organization
comment: A person or organization attending the event.

hasGS1DigitalLink
type: Property
domainIncludes: Product
domainIncludes: Place
domainIncludes: Offer
domainIncludes: Organization
isPartOf: pending.schema.org
comment: The GS1 digital link associated with the object. This URL should conform to the particular requirements of digital links. The link should only contain the Application Identifiers (AIs) that are relevant for the entity being annotated, for instance a Product or an Organization, and for the correct granularity. In particular, for products: A Digital Link that contains a serial number (AI 21) should only be present on instances of IndividualProduct A Digital Link that contains a lot number (AI 10) should be annotated as SomeProduct if only products from that lot are sold, or IndividualProduct if there is only a specific product. A Digital Link that contains a global model number (AI 8013) should be attached to a Product or a ProductModel. Other item types should be adapted similarly.
sub property of: identifier
source: https://github.com/schemaorg/schemaorg/issues/3475
rangeIncludes: URL

hasDriveThroughService
type: Property
domainIncludes: Place
isPartOf: pending.schema.org
source: https://github.com/schemaorg/schemaorg/issues/2490
rangeIncludes: Boolean
comment: Indicates whether some facility (e.g. FoodEstablishment, CovidTestingFacility) offers a service that can be used by driving through in a car. In the case of CovidTestingFacility such facilities could potentially help with social distancing from other potentially-infected users.

mechanismOfAction
type: Property
rangeIncludes: Text
domainIncludes: DietarySupplement
domainIncludes: Drug
comment: The specific biochemical interaction through which this drug or supplement produces its pharmacological effect.
isPartOf: health-lifesci.schema.org

TransformedContent
type: MediaManipulationRatingEnumeration
source: https://github.com/schemaorg/schemaorg/issues/2450
comment: Content coded 'transformed content' in a MediaReview, considered in the context of how it was published or shared. For a VideoObject to be 'transformed content': or all of the video has been manipulated to transform the footage itself. This category includes using tools like the Adobe Suite to change the speed of the video, add or remove visual elements or dub audio. Deepfakes are also a subset of transformation. For an ImageObject to be 'transformed content': Adding or deleting visual elements to give the image a different meaning with the intention to mislead. For an ImageObject with embedded text to be 'transformed content': Adding or deleting visual elements to give the image a different meaning with the intention to mislead. For an AudioObject to be 'transformed content': Part or all of the audio has been manipulated to alter the words or sounds, or the audio has been synthetically generated, such as to create a sound-alike voice.
isPartOf: pending.schema.org

skills
type: Property
domainIncludes: Occupation
domainIncludes: JobPosting
domainIncludes: Person
domainIncludes: Organization
comment: A statement of knowledge, skill, ability, task or any other assertion expressing a competency that is either claimed by a person, an organization or desired or required to fulfill a role or to work in an occupation.
source: https://github.com/schemaorg/schemaorg/issues/2322
source: https://github.com/schemaorg/schemaorg/issues/1698
rangeIncludes: Text
rangeIncludes: DefinedTerm

dateDeleted
type: Property
comment: The datetime the item was removed from the DataFeed.
rangeIncludes: DateTime
rangeIncludes: Date
domainIncludes: DataFeedItem

Monday
type: DayOfWeek
comment: The day of the week between Sunday and Tuesday.

MiddleSchool
type: Class
comment: A middle school (typically for children aged around 11-14, although this varies somewhat).
subclass of: EducationalOrganization

healthPlanId
type: Property
domainIncludes: HealthInsurancePlan
comment: The 14-character, HIOS-generated Plan ID number. (Plan IDs must be unique, even across different markets.)
rangeIncludes: Text
isPartOf: pending.schema.org
source: https://github.com/schemaorg/schemaorg/issues/1062

RVPark
type: Class
comment: A place offering space for "Recreational Vehicles", Caravans, mobile homes and the like.
subclass of: CivicStructure

DiabeticDiet
type: RestrictedDiet
comment: A diet appropriate for people with diabetes.

WearableSizeGroupTall
type: WearableSizeGroupEnumeration
source: https://github.com/schemaorg/schemaorg/issues/2811
isPartOf: pending.schema.org
comment: Size group "Tall" for wearables.

LimitedAvailability
type: ItemAvailability
comment: Indicates that the item has limited availability.

Locksmith
type: Class
subclass of: HomeAndConstructionBusiness
comment: A locksmith.

billingStart
type: Property
isPartOf: pending.schema.org
comment: Specifies after how much time this price (or price component) becomes valid and billing starts. Can be used, for example, to model a price increase after the first year of a subscription. The unit of measurement is specified by the unitCode property.
source: https://github.com/schemaorg/schemaorg/issues/2689
domainIncludes: UnitPriceSpecification
rangeIncludes: Number

MovieRentalStore
type: Class
subclass of: Store
comment: A movie rental store.

HousePainter
type: Class
comment: A house painting service.
subclass of: HomeAndConstructionBusiness

CohortStudy
type: MedicalObservationalStudyDesign
isPartOf: health-lifesci.schema.org
comment: Also known as a panel study. A cohort study is a form of longitudinal study used in medicine and social science. It is one type of study design and should be compared with a cross-sectional study. A cohort is a group of people who share a common characteristic or experience within a defined period (e.g., are born, leave school, lose their job, are exposed to a drug or a vaccine, etc.). The comparison group may be the general population from which the cohort is drawn, or it may be another cohort of persons thought to have had little or no exposure to the substance under investigation, but otherwise similar. Alternatively, subgroups within the cohort may be compared with each other.

ResumeAction
type: Class
subclass of: ControlAction
comment: The act of resuming a device or application which was formerly paused (e.g. resume music playback or resume a timer).

Nonprofit501c3
type: USNonprofitType
isPartOf: pending.schema.org
comment: Nonprofit501c3: Non-profit type referring to Religious, Educational, Charitable, Scientific, Literary, Testing for Public Safety, Fostering National or International Amateur Sports Competition, or Prevention of Cruelty to Children or Animals Organizations.
source: https://github.com/schemaorg/schemaorg/issues/2543

GroceryStore
type: Class
subclass of: Store
comment: A grocery store.

NoteDigitalDocument
type: Class
comment: A file containing a note, primarily for the author.
subclass of: DigitalDocument

NonprofitSBBI
type: NLNonprofitType
isPartOf: pending.schema.org
comment: NonprofitSBBI: Non-profit type referring to a Social Interest Promoting Institution (NL).
source: https://github.com/schemaorg/schemaorg/issues/2543

HowItWorksHealthAspect
type: HealthAspectEnumeration
comment: Content that discusses and explains how a particular health-related topic works, e.g. in terms of mechanisms and underlying science.
source: https://github.com/schemaorg/schemaorg/issues/2799
isPartOf: pending.schema.org

positiveNotes
type: Property
rangeIncludes: ListItem
rangeIncludes: Text
rangeIncludes: WebContent
rangeIncludes: ItemList
comment: Provides positive considerations regarding something, for example product highlights or (alongside negativeNotes) pro/con lists for reviews. In the case of a Review, the property describes the itemReviewed from the perspective of the review; in the case of a Product, the product itself is being described. The property values can be expressed either as unstructured text (repeated as necessary), or if ordered, as a list (in which case the most positive is at the beginning of the list).
domainIncludes: Product
domainIncludes: Review
source: https://github.com/schemaorg/schemaorg/issues/2832
isPartOf: pending.schema.org

pageStart
type: Property
domainIncludes: PublicationIssue
domainIncludes: Article
domainIncludes: PublicationVolume
domainIncludes: Chapter
contributor: bibex
comment: The page on which the work starts; for example "135" or "xiii".
equivalent property: pageStart
rangeIncludes: Text
rangeIncludes: Integer

priceSpecification
type: Property
comment: One or more detailed price specifications, indicating the unit price and delivery or payment charges.
domainIncludes: Demand
domainIncludes: Offer
domainIncludes: DonateAction
domainIncludes: TradeAction
equivalent class: AmountType
contributor: GoodRelationsTerms
rangeIncludes: PriceSpecification

IncentiveStatusOnHold
type: IncentiveStatus
isPartOf: pending.schema.org
source: https://github.com/schemaorg/schemaorg/issues/3572
comment: This incentive is currently active, but may not be accepting new applicants (e.g. max number of redemptions reached for a year)

RadioClip
type: Class
subclass of: Clip
comment: A short radio program or a segment/part of a radio program.

governmentBenefitsInfo
type: Property
domainIncludes: SpecialAnnouncement
isPartOf: pending.schema.org
comment: governmentBenefitsInfo provides information about government benefits associated with a SpecialAnnouncement.
source: https://github.com/schemaorg/schemaorg/issues/2534
rangeIncludes: GovernmentService

riskFactor
type: Property
domainIncludes: MedicalCondition
isPartOf: health-lifesci.schema.org
rangeIncludes: MedicalRiskFactor
comment: A modifiable or non-modifiable factor that increases the risk of a patient contracting this condition, e.g. age, coexisting condition.

Nonprofit501c19
type: USNonprofitType
source: https://github.com/schemaorg/schemaorg/issues/2543
comment: Nonprofit501c19: Non-profit type referring to Post or Organization of Past or Present Members of the Armed Forces.
isPartOf: pending.schema.org

AmusementPark
type: Class
subclass of: EntertainmentBusiness
comment: An amusement park.

contentRating
type: Property
rangeIncludes: Text
rangeIncludes: Rating
comment: Official rating of a piece of content—for example, 'MPAA PG-13'.
domainIncludes: CreativeWork

algorithm
type: Property
comment: The algorithm or rules to follow to compute the score.
rangeIncludes: Text
domainIncludes: MedicalRiskScore
isPartOf: health-lifesci.schema.org

geoDisjoint
type: Property
comment: Represents spatial relations in which two geometries (or the places they represent) are topologically disjoint: "they have no point in common. They form a set of disconnected geometries." (A symmetric relationship, as defined in [DE-9IM](https://en.wikipedia.org/wiki/DE-9IM).)
rangeIncludes: Place
rangeIncludes: GeospatialGeometry
domainIncludes: GeospatialGeometry
domainIncludes: Place

branchCode
type: Property
rangeIncludes: Text
domainIncludes: Place
comment: A short textual code (also called "store code") that uniquely identifies a place of business. The code is typically assigned by the parentOrganization and used in structured URLs.\n\nFor example, in the URL http://www.starbucks.co.uk/store-locator/etc/detail/3047 the code "3047" is a branchCode for a particular branch.

OfficialLegalValue
type: LegalValueLevel
source: https://github.com/schemaorg/schemaorg/issues/1156
source: eli
contributor: ELI
comment: All the documents published by an official publisher should have at least the legal value level "OfficialLegalValue". This indicates that the document was published by an organisation with the public task of making it available (e.g. a consolidated version of a EU directive published by the EU Office of Publications).
isPartOf: pending.schema.org

priceComponent
type: Property
comment: This property links to all UnitPriceSpecification nodes that apply in parallel for the CompoundPriceSpecification node.
rangeIncludes: PriceSpecification
domainIncludes: CompoundPriceSpecification
contributor: GoodRelationsTerms

InStoreOnly
type: ItemAvailability
comment: Indicates that the item is available only at physical locations.

freeShippingThreshold
type: Property
source: https://github.com/schemaorg/schemaorg/issues/2506
rangeIncludes: DeliveryChargeSpecification
rangeIncludes: MonetaryAmount
comment: A monetary value above (or at) which the shipping rate becomes free. Intended to be used via an OfferShippingDetails with shippingSettingsLink matching this ShippingRateSettings.
domainIncludes: ShippingRateSettings

workHours
type: Property
comment: The typical working hours for this job (e.g. 1st shift, night shift, 8am-5pm).
domainIncludes: JobPosting
rangeIncludes: Text

driveWheelConfiguration
type: Property
comment: The drive wheel configuration, i.e. which roadwheels will receive torque from the vehicle's engine via the drivetrain.
contributor: Automotive Ontology Working Group
domainIncludes: Vehicle
rangeIncludes: Text
rangeIncludes: DriveWheelConfigurationValue

EUEnergyEfficiencyCategoryC
type: EUEnergyEfficiencyEnumeration
comment: Represents EU Energy Efficiency Class C as defined in EU energy labeling regulations.
isPartOf: pending.schema.org
source: https://github.com/schemaorg/schemaorg/issues/2670

fiberContent
type: Property
domainIncludes: NutritionInformation
comment: The number of grams of fiber.
rangeIncludes: Mass

MusicEvent
type: Class
subclass of: Event
comment: Event type: Music event.

ResultsNotAvailable
type: MedicalStudyStatus
comment: Results are not available.
isPartOf: health-lifesci.schema.org

productID
type: Property
comment: The product identifier, such as ISBN. For example: ``` meta itemprop="productID" content="isbn:123-456-789" ```.
rangeIncludes: Text
domainIncludes: Product
sub property of: identifier

specialty
type: Property
comment: One of the domain specialities to which this web page's content applies.
rangeIncludes: Specialty
domainIncludes: WebPage

percentile90
type: Property
source: https://github.com/schemaorg/schemaorg/issues/1698
domainIncludes: QuantitativeValueDistribution
comment: The 90th percentile value.
rangeIncludes: Number

trainNumber
type: Property
rangeIncludes: Text
comment: The unique identifier for the train.
domainIncludes: TrainTrip

RegularPrice
type: PriceTypeEnumeration
isPartOf: pending.schema.org
source: https://github.com/schemaorg/schemaorg/issues/3583
comment: Represents the regular price of an offered product. This is usually the advertised price before a temporary sale. Once the sale period ends the advertised price will go back to the regular price.

Male
type: GenderType
comment: The male gender.

borrower
type: Property
domainIncludes: LendAction
rangeIncludes: Person
sub property of: participant
comment: A sub property of participant. The person that borrows the object being lent.

dayOfWeek
type: Property
comment: The day of the week for which these opening hours are valid.
domainIncludes: EducationalOccupationalProgram
domainIncludes: OpeningHoursSpecification
rangeIncludes: DayOfWeek
contributor: GoodRelationsTerms

interactivityType
type: Property
rangeIncludes: Text
domainIncludes: CreativeWork
comment: The predominant mode of learning supported by the learning resource. Acceptable values are 'active', 'expositive', or 'mixed'.

auditDate
type: Property
comment: Date when a certification was last audited. See also [gs1:certificationAuditDate](https://www.gs1.org/voc/certificationAuditDate).
source: https://github.com/schemaorg/schemaorg/issues/3230
rangeIncludes: DateTime
rangeIncludes: Date
equivalent property: InspectionDateTime
domainIncludes: Certification

StudioAlbum
type: MusicAlbumProductionType
contributor: MBZ
comment: StudioAlbum.

AutoDealer
type: Class
comment: An car dealership.
subclass of: AutomotiveBusiness

data
type: Property
comment: Data associated with the event, like for instance a log message.
isPartOf: pending.schema.org
rangeIncludes: Thing
source: https://github.com/schemaorg/schemaorg/issues/4527
domainIncludes: InstantaneousEvent

OfflineTemporarily
type: GameServerStatus
comment: Game server status: OfflineTemporarily. Server is offline now but it can be online soon.

WearableSizeGroupMaternity
type: WearableSizeGroupEnumeration
source: https://github.com/schemaorg/schemaorg/issues/2811
comment: Size group "Maternity" for wearables.
isPartOf: pending.schema.org

saturatedFatContent
type: Property
domainIncludes: NutritionInformation
rangeIncludes: Mass
comment: The number of grams of saturated fat.

MSRP
type: PriceTypeEnumeration
comment: Represents the manufacturer suggested retail price ("MSRP") of an offered product.
isPartOf: pending.schema.org
source: https://github.com/schemaorg/schemaorg/issues/2712

CompositeDigitalSource
type: IPTCDigitalSourceEnumeration
isPartOf: pending.schema.org
source: https://github.com/schemaorg/schemaorg/issues/3392
comment: Content coded as 'algorithmic media' using the IPTC digital source type vocabulary.

follows
type: Property
rangeIncludes: Person
comment: The most generic uni-directional social relation.
domainIncludes: Person

RandomizedTrial
type: MedicalTrialDesign
isPartOf: health-lifesci.schema.org
comment: A randomized trial design.

paymentStatus
type: Property
domainIncludes: Invoice
rangeIncludes: Text
rangeIncludes: PaymentStatusType
comment: The status of payment; whether the invoice has been paid or not.

actionStatus
type: Property
domainIncludes: Action
comment: Indicates the current disposition of the Action.
rangeIncludes: ActionStatusType

audienceType
type: Property
comment: The target group associated with a given audience (e.g. veterans, car owners, musicians, etc.).
rangeIncludes: Text
domainIncludes: Audience

yearlyRevenue
type: Property
domainIncludes: BusinessAudience
rangeIncludes: QuantitativeValue
comment: The size of the business in annual revenue.

SheetMusic
type: Class
subclass of: CreativeWork
comment: Printed music, as opposed to performed or recorded music.
isPartOf: pending.schema.org
source: https://github.com/schemaorg/schemaorg/issues/1448

availableThrough
type: Property
domainIncludes: DeliveryEvent
comment: After this date, the item will no longer be available for pickup.
rangeIncludes: DateTime

contactOption
type: Property
comment: An option available on this contact point (e.g. a toll-free number or support for hearing-impaired callers).
domainIncludes: ContactPoint
rangeIncludes: ContactPointOption

arrivalStation
type: Property
domainIncludes: TrainTrip
comment: The station where the train trip ends.
rangeIncludes: TrainStation

PreSale
type: ItemAvailability
comment: Indicates that the item is available for ordering and delivery before general availability.

EventReservation
type: Class
subclass of: Reservation
comment: A reservation for an event like a concert, sporting event, or lecture.\n\nNote: This type is for information about actual reservations, e.g. in confirmation emails or HTML pages with individual confirmations of reservations. For offers of tickets, use Offer.

installUrl
type: Property
domainIncludes: SoftwareApplication
comment: URL at which the app may be installed, if different from the URL of the item.
rangeIncludes: URL

healthPlanCoinsuranceRate
type: Property
domainIncludes: HealthPlanCostSharingSpecification
isPartOf: pending.schema.org
source: https://github.com/schemaorg/schemaorg/issues/1062
comment: The rate of coinsurance expressed as a number between 0.0 and 1.0.
rangeIncludes: Number

responsibilities
type: Property
domainIncludes: JobPosting
domainIncludes: Occupation
rangeIncludes: Text
source: https://github.com/schemaorg/schemaorg/issues/1698
comment: Responsibilities associated with this role or Occupation.

greaterOrEqual
type: Property
contributor: GoodRelationsTerms
domainIncludes: QualitativeValue
comment: This ordering relation for qualitative values indicates that the subject is greater than or equal to the object.
rangeIncludes: QualitativeValue

suggestedAge
type: Property
rangeIncludes: QuantitativeValue
source: https://github.com/schemaorg/schemaorg/issues/2811
domainIncludes: PeopleAudience
domainIncludes: SizeSpecification
comment: The age or age range for the intended audience or person, for example 3-12 months for infants, 1-5 years for toddlers.
isPartOf: pending.schema.org

OverviewHealthAspect
type: HealthAspectEnumeration
comment: Overview of the content. Contains a summarized view of the topic with the most relevant information for an introduction.
isPartOf: pending.schema.org
source: https://github.com/schemaorg/schemaorg/issues/2374

Thursday
type: DayOfWeek
comment: The day of the week between Wednesday and Friday.

letterer
type: Property
rangeIncludes: Person
domainIncludes: VisualArtwork
domainIncludes: ComicStory
domainIncludes: ComicIssue
isPartOf: bib.schema.org
comment: The individual who adds lettering, including speech balloons and sound effects, to artwork.

orderNumber
type: Property
comment: The identifier of the transaction.
rangeIncludes: Text
equivalent property: OrderIdentifier
domainIncludes: Order
sub property of: identifier

availableFrom
type: Property
domainIncludes: DeliveryEvent
rangeIncludes: DateTime
comment: When the item is available for pickup from the store, locker, etc.

postalCode
type: Property
rangeIncludes: Text
domainIncludes: PostalAddress
domainIncludes: DefinedRegion
domainIncludes: GeoShape
domainIncludes: GeoCoordinates
equivalent property: hasPostalCode
equivalent property: postcodeCode
comment: The postal code. For example, 94043.
source: https://github.com/schemaorg/schemaorg/issues/2506

breadcrumb
type: Property
rangeIncludes: BreadcrumbList
rangeIncludes: Text
comment: A set of links that can help a user understand and navigate a website hierarchy.
domainIncludes: WebPage

loanMortgageMandateAmount
type: Property
source: https://github.com/schemaorg/schemaorg/issues/1253
domainIncludes: MortgageLoan
rangeIncludes: MonetaryAmount
comment: Amount of mortgage mandate that can be converted into a proper mortgage at a later stage.
contributor: FIBO
isPartOf: pending.schema.org

Online
type: GameServerStatus
comment: Game server status: Online. Server is available.

Nonprofit501c12
type: USNonprofitType
comment: Nonprofit501c12: Non-profit type referring to Benevolent Life Insurance Associations, Mutual Ditch or Irrigation Companies, Mutual or Cooperative Telephone Companies.
isPartOf: pending.schema.org
source: https://github.com/schemaorg/schemaorg/issues/2543

InvoicePrice
type: PriceTypeEnumeration
source: https://github.com/schemaorg/schemaorg/issues/2712
comment: Represents the invoice price of an offered product.
isPartOf: pending.schema.org

BodyMeasurementWaist
type: BodyMeasurementTypeEnumeration
comment: Girth of natural waistline (between hip bones and lower ribs). Used, for example, to fit pants.
source: https://github.com/schemaorg/schemaorg/issues/2811
isPartOf: pending.schema.org

itemLocation
type: Property
rangeIncludes: Place
rangeIncludes: PostalAddress
rangeIncludes: Text
comment: Current location of the item.
source: https://github.com/schemaorg/schemaorg/issues/1758
isPartOf: pending.schema.org
sub property of: location
domainIncludes: ArchiveComponent

Lung
type: PhysicalExam
isPartOf: health-lifesci.schema.org
comment: Lung and respiratory system clinical examination.

Library
type: Class
comment: A library.
subclass of: LocalBusiness

interactionType
type: Property
rangeIncludes: Action
comment: The Action representing the type of interaction. For up votes, +1s, etc. use LikeAction. For down votes use DislikeAction. Otherwise, use the most specific Action.
domainIncludes: InteractionCounter

healthPlanCoinsuranceOption
type: Property
rangeIncludes: Text
domainIncludes: HealthPlanCostSharingSpecification
isPartOf: pending.schema.org
source: https://github.com/schemaorg/schemaorg/issues/1062
comment: Whether the coinsurance applies before or after deductible, etc. TODO: Is this a closed set?

DigitalAudioTapeFormat
type: MusicReleaseFormatType
comment: DigitalAudioTapeFormat.
contributor: MBZ

publicationType
type: Property
rangeIncludes: Text
domainIncludes: MedicalScholarlyArticle
isPartOf: health-lifesci.schema.org
comment: The type of the medical article, taken from the US NLM MeSH publication type catalog. See also [MeSH documentation](http://www.nlm.nih.gov/mesh/pubtypes.html).

UserPlays
type: Class
subclass of: UserInteraction
comment: UserInteraction and its subtypes is an old way of talking about users interacting with pages. It is generally better to use Action-based vocabulary, alongside types such as Comment.
supersededBy: InteractionCounter

CampingPitch
type: Class
contributor: STI Accommodation Ontology
subclass of: Accommodation
comment: A CampingPitch is an individual place for overnight stay in the outdoors, typically being part of a larger camping site, or Campground.\n\n In British English a campsite, or campground, is an area, usually divided into a number of pitches, where people can camp overnight using tents or camper vans or caravans; this British English use of the word is synonymous with the American English expression campground. In American English the term campsite generally means an area where an individual, family, group, or military unit can pitch a tent or park a camper; a campground may contain many campsites. (Source: Wikipedia, see [https://en.wikipedia.org/wiki/Campsite](https://en.wikipedia.org/wiki/Campsite).)\n\n See also the dedicated [document on the use of schema.org for marking up hotels and other forms of accommodations](/docs/hotels.html).

energyEfficiencyScaleMax
type: Property
rangeIncludes: EUEnergyEfficiencyEnumeration
comment: Specifies the most energy efficient class on the regulated EU energy consumption scale for the product category a product belongs to. For example, energy consumption for televisions placed on the market after January 1, 2020 is scaled from D to A+++.
isPartOf: pending.schema.org
source: https://github.com/schemaorg/schemaorg/issues/2670
domainIncludes: EnergyConsumptionDetails

OriginalShippingFees
type: ReturnFeesEnumeration
isPartOf: pending.schema.org
source: https://github.com/schemaorg/schemaorg/issues/2288
comment: Specifies that the customer must pay the original shipping costs when returning a product.

representativeOfPage
type: Property
comment: Indicates whether this image is representative of the content of the page.
rangeIncludes: Boolean
domainIncludes: ImageObject

inAlbum
type: Property
domainIncludes: MusicRecording
rangeIncludes: MusicAlbum
comment: The album to which this recording belongs.

Gynecologic
type: MedicalSpecialty
comment: A specific branch of medical science that pertains to the health care of women, particularly in the diagnosis and treatment of disorders affecting the female reproductive system.
isPartOf: health-lifesci.schema.org
subclass of: MedicalBusiness

dosageForm
type: Property
domainIncludes: Drug
rangeIncludes: Text
comment: A dosage form in which this drug/supplement is available, e.g. 'tablet', 'suspension', 'injection'.
isPartOf: health-lifesci.schema.org

cvdNumBeds
type: Property
source: https://github.com/schemaorg/schemaorg/issues/2521
rangeIncludes: Number
comment: numbeds - HOSPITAL INPATIENT BEDS: Inpatient beds, including all staffed, licensed, and overflow (surge) beds used for inpatients.
isPartOf: pending.schema.org
domainIncludes: CDCPMDRecord

audio
type: Property
domainIncludes: CreativeWork
rangeIncludes: MusicRecording
rangeIncludes: Clip
rangeIncludes: AudioObject
comment: An embedded audio object.
source: https://github.com/schemaorg/schemaorg/issues/2420

EmploymentAgency
type: Class
subclass of: LocalBusiness
comment: An employment agency.

roofLoad
type: Property
rangeIncludes: QuantitativeValue
domainIncludes: Car
domainIncludes: BusOrCoach
isPartOf: auto.schema.org
comment: The permitted total weight of cargo and installations (e.g. a roof rack) on top of the vehicle.\n\nTypical unit code(s): KGM for kilogram, LBR for pound\n\n* Note 1: You can indicate additional information in the name of the QuantitativeValue node.\n* Note 2: You may also link to a QualitativeValue node that provides additional information using valueReference\n* Note 3: Note that you can use minValue and maxValue to indicate ranges.
contributor: Automotive Ontology Working Group

hospitalAffiliation
type: Property
comment: A hospital with which the physician or office is affiliated.
rangeIncludes: Hospital
isPartOf: health-lifesci.schema.org
domainIncludes: Physician

EventScheduled
type: EventStatusType
comment: The event is taking place or has taken place on the startDate as scheduled. Use of this value is optional, as it is assumed by default.

Brewery
type: Class
comment: Brewery.
subclass of: FoodEstablishment

rxcui
type: Property
comment: The RxCUI drug identifier from RXNORM.
domainIncludes: Drug
rangeIncludes: Text
isPartOf: pending.schema.org
source: https://github.com/schemaorg/schemaorg/issues/1062

Nonprofit501c26
type: USNonprofitType
isPartOf: pending.schema.org
source: https://github.com/schemaorg/schemaorg/issues/2543
comment: Nonprofit501c26: Non-profit type referring to State-Sponsored Organizations Providing Health Coverage for High-Risk Individuals.

healthPlanNetworkId
type: Property
isPartOf: pending.schema.org
source: https://github.com/schemaorg/schemaorg/issues/1062
rangeIncludes: Text
comment: Name or unique ID of network. (Networks are often reused across different insurance plans.)
domainIncludes: HealthPlanNetwork
domainIncludes: MedicalOrganization

answerCount
type: Property
rangeIncludes: Integer
domainIncludes: Question
comment: The number of answers this question has received.

Hostel
type: Class
comment: A hostel - cheap accommodation, often in shared dormitories. See also the dedicated document on the use of schema.org for marking up hotels and other forms of accommodations.
subclass of: LodgingBusiness

isStoreOn
type: Property
rangeIncludes: OnlineMarketplace
isPartOf: pending.schema.org
source: https://github.com/schemaorg/schemaorg/issues/4470
comment: The eCommerce marketplace this online store is on.
domainIncludes: OnlineStore

runtime
type: Property
rangeIncludes: Text
domainIncludes: SoftwareSourceCode
supersededBy: runtimePlatform
comment: Runtime platform or script interpreter dependencies (example: Java v1, Python 2.3, .NET Framework 3.0).

runtimePlatform
type: Property
domainIncludes: SoftwareApplication
domainIncludes: SoftwareSourceCode
comment: Runtime platform or script interpreter dependencies (example: Java v1, Python 2.3, .NET Framework 3.0).
rangeIncludes: Text
rangeIncludes: RuntimePlatform

EnergyStarCertified
type: EnergyStarEnergyEfficiencyEnumeration
comment: Represents EnergyStar certification.
isPartOf: pending.schema.org
source: https://github.com/schemaorg/schemaorg/issues/2670

CurrencyConversionService
type: Class
subclass of: FinancialProduct
comment: A service to convert funds from one currency to another currency.
contributor: FIBO

WearableSizeGroupHusky
type: WearableSizeGroupEnumeration
comment: Size group "Husky" (or "Stocky") for wearables.
isPartOf: pending.schema.org
source: https://github.com/schemaorg/schemaorg/issues/2811

inSupportOf
type: Property
isPartOf: bib.schema.org
comment: Qualification, candidature, degree, application that Thesis supports.
domainIncludes: Thesis
rangeIncludes: Text

carrier
type: Property
comment: 'carrier' is an out-dated term indicating the 'provider' for parcel delivery and flights.
supersededBy: provider
domainIncludes: ParcelDelivery
domainIncludes: Flight
rangeIncludes: Organization

provider
type: Property
domainIncludes: EducationalOccupationalProgram
domainIncludes: FinancialIncentive
domainIncludes: Invoice
domainIncludes: CreativeWork
domainIncludes: Service
domainIncludes: Trip
domainIncludes: ParcelDelivery
domainIncludes: Reservation
domainIncludes: Action
equivalent property: ServiceProvider
isPartOf: pending.schema.org
comment: The service provider, service operator, or service performer; the goods producer. Another party (a seller) may offer those services or goods on behalf of the provider. A provider may also serve as the seller.
source: https://github.com/schemaorg/schemaorg/issues/2927
source: https://github.com/schemaorg/schemaorg/issues/2289
rangeIncludes: Person
rangeIncludes: Organization

customerRemorseReturnLabelSource
type: Property
rangeIncludes: ReturnLabelSourceEnumeration
comment: The method (from an enumeration) by which the customer obtains a return shipping label for a product returned due to customer remorse.
isPartOf: pending.schema.org
source: https://github.com/schemaorg/schemaorg/issues/2880
domainIncludes: MerchantReturnPolicy

MultiFrameComputationalCaptureDigitalSource
type: IPTCDigitalSourceEnumeration
source: https://github.com/schemaorg/schemaorg/issues/3392
comment: Content coded as 'algorithmic media' using the IPTC digital source type vocabulary.
isPartOf: pending.schema.org

dateVehicleFirstRegistered
type: Property
comment: The date of the first registration of the vehicle with the respective public authorities.
contributor: Automotive Ontology Working Group
domainIncludes: Vehicle
rangeIncludes: Date

dropoffLocation
type: Property
domainIncludes: RentalCarReservation
rangeIncludes: Place
comment: Where a rental car can be dropped off.

arrivalGate
type: Property
comment: Identifier of the flight's arrival gate.
domainIncludes: Flight
rangeIncludes: Text

startOffset
type: Property
domainIncludes: Clip
domainIncludes: SeekToAction
rangeIncludes: HyperTocEntry
rangeIncludes: Number
isPartOf: pending.schema.org
comment: The start time of the clip expressed as the number of seconds from the beginning of the work.
source: https://github.com/schemaorg/schemaorg/issues/2021

dropoffTime
type: Property
domainIncludes: RentalCarReservation
rangeIncludes: DateTime
comment: When a rental car can be dropped off.

Park
type: Class
subclass of: CivicStructure
comment: A park.

arrivalBoatTerminal
type: Property
rangeIncludes: BoatTerminal
comment: The terminal or port from which the boat arrives.
domainIncludes: BoatTrip
isPartOf: pending.schema.org
source: https://github.com/schemaorg/schemaorg/issues/1755

replyToUrl
type: Property
domainIncludes: UserComments
rangeIncludes: URL
comment: The URL at which a reply may be posted to the specified UserComment.

eligibleQuantity
type: Property
domainIncludes: Demand
domainIncludes: PriceSpecification
domainIncludes: Offer
comment: The interval and unit of measurement of ordering quantities for which the offer or price specification is valid. This allows e.g. specifying that a certain freight charge is valid only for a certain quantity.
rangeIncludes: QuantitativeValue
contributor: GoodRelationsTerms

PotentialActionStatus
type: ActionStatusType
comment: A description of an action that is supported.

parents
type: Property
domainIncludes: Person
rangeIncludes: Person
comment: A parents of the person.
supersededBy: parent

parent
type: Property
rangeIncludes: Person
domainIncludes: Person
comment: A parent of this person.

containedIn
type: Property
rangeIncludes: Place
comment: The basic containment relation between a place and one that contains it.
supersededBy: containedInPlace
domainIncludes: Place

containedInPlace
type: Property
rangeIncludes: Place
inverseOf: containsPlace
comment: The basic containment relation between a place and one that contains it.
domainIncludes: Place

SalePrice
type: PriceTypeEnumeration
isPartOf: pending.schema.org
comment: Represents a sale price (usually active for a limited period) of an offered product.
source: https://github.com/schemaorg/schemaorg/issues/2712

FDAcategoryD
type: DrugPregnancyCategory
comment: A designation by the US FDA signifying that there is positive evidence of human fetal risk based on adverse reaction data from investigational or marketing experience or studies in humans, but potential benefits may warrant use of the drug in pregnant women despite potential risks.
isPartOf: health-lifesci.schema.org

IncentiveQualifiedExpenseTypeGoodsOnly
type: IncentiveQualifiedExpenseType
isPartOf: pending.schema.org
source: https://github.com/schemaorg/schemaorg/issues/3572
comment: This incentive applies to goods only.

linkRelationship
type: Property
domainIncludes: LinkRole
rangeIncludes: Text
isPartOf: pending.schema.org
source: https://github.com/schemaorg/schemaorg/issues/1045
comment: Indicates the relationship type of a Web link.

RemixAlbum
type: MusicAlbumProductionType
comment: RemixAlbum.
contributor: MBZ

administrationRoute
type: Property
domainIncludes: Drug
rangeIncludes: Text
isPartOf: health-lifesci.schema.org
comment: A route by which this drug may be administered, e.g. 'oral'.

CoOp
type: GamePlayMode
comment: Play mode: CoOp. Co-operative games, where you play on the same team with friends.

ReservationPending
type: ReservationStatusType
comment: The status of a reservation when a request has been sent, but not confirmed.

PaymentDue
type: PaymentStatusType
comment: The payment is due, but still within an acceptable time to be received.

DefenceEstablishment
type: Class
subclass of: GovernmentBuilding
comment: A defence establishment, such as an army or navy base.

certificationStatus
type: Property
domainIncludes: Certification
comment: Indicates the current status of a certification: active or inactive. See also [gs1:certificationStatus](https://www.gs1.org/voc/certificationStatus).
source: https://github.com/schemaorg/schemaorg/issues/3230
rangeIncludes: CertificationStatusEnumeration

dateline
type: Property
domainIncludes: NewsArticle
rangeIncludes: Text
comment: A [dateline](https://en.wikipedia.org/wiki/Dateline) is a brief piece of text included in news articles that describes where and when the story was written or filed though the date is often omitted. Sometimes only a placename is provided. Structured representations of dateline-related information can also be expressed more explicitly using locationCreated (which represents where a work was created, e.g. where a news report was written). For location depicted or described in the content, use contentLocation. Dateline summaries are oriented more towards human readers than towards automated processing, and can vary substantially. Some examples: "BEIRUT, Lebanon, June 2.", "Paris, France", "December 19, 2017 11:43AM Reporting from Washington", "Beijing/Moscow", "QUEZON CITY, Philippines".

Season
type: Class
subclass of: CreativeWork
comment: A media season, e.g. TV, radio, video game etc.
supersededBy: CreativeWorkSeason

PositiveFilmDigitalSource
type: IPTCDigitalSourceEnumeration
comment: Content coded as 'positive film' using the IPTC digital source type vocabulary.
source: https://github.com/schemaorg/schemaorg/issues/3392
isPartOf: pending.schema.org

AdultEntertainment
type: Class
subclass of: EntertainmentBusiness
comment: An adult entertainment establishment.

LibrarySystem
type: Class
comment: A LibrarySystem is a collaborative system amongst several libraries.
source: https://github.com/schemaorg/schemaorg/issues/1495
subclass of: Organization
isPartOf: pending.schema.org

BedAndBreakfast
type: Class
subclass of: LodgingBusiness
comment: Bed and breakfast. See also the dedicated document on the use of schema.org for marking up hotels and other forms of accommodations.

PreventionIndication
type: Class
comment: An indication for preventing an underlying condition, symptom, etc.
subclass of: MedicalIndication
isPartOf: health-lifesci.schema.org

SeatingMap
type: MapCategoryType
comment: A seating map.

Cemetery
type: Class
comment: A graveyard.
subclass of: CivicStructure

vatID
type: Property
contributor: GoodRelationsTerms
domainIncludes: Person
domainIncludes: Organization
comment: The Value-added Tax ID of the organization or person.
rangeIncludes: Text

ShoeStore
type: Class
comment: A shoe store.
subclass of: Store

True
type: Boolean
comment: The boolean value true.

OrderDelivered
type: OrderStatus
comment: OrderStatus representing successful delivery of an order.

ExampleMeasurementMethodEnum
type: MeasurementMethodEnum
isPartOf: pending.schema.org
source: https://github.com/schemaorg/schemaorg/issues/2564
comment: An example MeasurementMethodEnum (to remove when real enums are added).

RespiratoryTherapy
type: MedicalSpecialty
subclass of: MedicalTherapy
isPartOf: health-lifesci.schema.org
comment: The therapy that is concerned with the maintenance or improvement of respiratory function (as in patients with pulmonary disease).

ReservationCancelled
type: ReservationStatusType
comment: The status for a previously confirmed reservation that is now cancelled.

PetStore
type: Class
subclass of: Store
comment: A pet store.

usesDevice
type: Property
rangeIncludes: MedicalDevice
comment: Device used to perform the test.
domainIncludes: MedicalTest
isPartOf: health-lifesci.schema.org

ArriveAction
type: Class
subclass of: MoveAction
comment: The act of arriving at a place. An agent arrives at a destination from a fromLocation, optionally with participants.

WPSideBar
type: Class
subclass of: WebPageElement
comment: A sidebar section of the page.

collectionSize
type: Property
comment: The number of items in the Collection.
rangeIncludes: Integer
domainIncludes: Collection
isPartOf: pending.schema.org
source: https://github.com/schemaorg/schemaorg/issues/1759

ReimbursementCap
type: DrugCostCategory
isPartOf: health-lifesci.schema.org
comment: The drug's cost represents the maximum reimbursement paid by an insurer for the drug.

courseSchedule
type: Property
rangeIncludes: Schedule
domainIncludes: CourseInstance
isPartOf: pending.schema.org
source: https://github.com/schemaorg/schemaorg/issues/3281
comment: Represents the length and pace of a course, expressed as a Schedule.

MRI
type: MedicalImagingTechnique
isPartOf: health-lifesci.schema.org
comment: Magnetic resonance imaging.

honorificSuffix
type: Property
rangeIncludes: Text
comment: An honorific suffix following a Person's name such as M.D./PhD/MSCSW.
domainIncludes: Person

commentCount
type: Property
rangeIncludes: Integer
comment: The number of comments this CreativeWork (e.g. Article, Question or Answer) has received. This is most applicable to works published in Web sites with commenting system; additional comments may exist elsewhere.
domainIncludes: CreativeWork

version
type: Property
comment: The version of the CreativeWork embodied by a specified resource.
rangeIncludes: Number
rangeIncludes: Text
domainIncludes: CreativeWork

studySubject
type: Property
domainIncludes: MedicalStudy
rangeIncludes: MedicalEntity
comment: A subject of the study, i.e. one of the medical conditions, therapies, devices, drugs, etc. investigated by the study.
isPartOf: health-lifesci.schema.org

UserLikes
type: Class
comment: UserInteraction and its subtypes is an old way of talking about users interacting with pages. It is generally better to use Action-based vocabulary, alongside types such as Comment.
supersededBy: InteractionCounter
subclass of: UserInteraction

experienceInPlaceOfEducation
type: Property
domainIncludes: JobPosting
isPartOf: pending.schema.org
source: https://github.com/schemaorg/schemaorg/issues/2681
comment: Indicates whether a JobPosting will accept experience (as indicated by OccupationalExperienceRequirements) in place of its formal educational qualifications (as indicated by educationRequirements). If true, indicates that satisfying one of these requirements is sufficient.
rangeIncludes: Boolean

totalHistoricalEnrollment
type: Property
rangeIncludes: Integer
isPartOf: pending.schema.org
domainIncludes: Course
source: https://github.com/schemaorg/schemaorg/issues/3281
comment: The total number of students that have enrolled in the history of the course.

IncentiveTypeLoan
type: IncentiveType
comment: An incentive where the recipient can receive additional funding for the purchase/lease of the good/service, which must be paid back.
isPartOf: pending.schema.org
source: https://github.com/schemaorg/schemaorg/issues/3572

PlasticSurgery
type: MedicalSpecialty
isPartOf: health-lifesci.schema.org
comment: A specific branch of medical science that pertains to therapeutic or cosmetic repair or re-formation of missing, injured or malformed tissues or body parts by manual and instrumental means.
subclass of: MedicalBusiness

TouristInformationCenter
type: Class
subclass of: LocalBusiness
comment: A tourist information center.

FulfillmentTypeScheduledDelivery
type: FulfillmentTypeEnumeration
isPartOf: pending.schema.org
comment: Fulfillment to a customer selected address after scheduling with the customer.
source: https://github.com/schemaorg/schemaorg/issues/3617

SafetyHealthAspect
type: HealthAspectEnumeration
source: https://github.com/schemaorg/schemaorg/issues/2799
isPartOf: pending.schema.org
comment: Content about the safety-related aspects of a health topic.

contentSize
type: Property
comment: File size in (mega/kilo)bytes.
rangeIncludes: Text
domainIncludes: MediaObject

originAddress
type: Property
comment: Shipper's address.
rangeIncludes: PostalAddress
domainIncludes: ParcelDelivery

HealthcareConsideration
type: AdultOrientedEnumeration
isPartOf: pending.schema.org
source: https://github.com/schemaorg/schemaorg/issues/2989
comment: Item is a pharmaceutical (e.g., a prescription or OTC drug) or a restricted medical device.

birthDate
type: Property
comment: Date of birth.
domainIncludes: Person
rangeIncludes: Date

LaserDiscFormat
type: MusicReleaseFormatType
comment: LaserDiscFormat.
contributor: MBZ

NotInForce
type: LegalForceStatus
source: https://github.com/schemaorg/schemaorg/issues/1156
source: eli
contributor: ELI
comment: Indicates that a legislation is currently not in force.
isPartOf: pending.schema.org

observationAbout
type: Property
comment: The observationAbout property identifies an entity, often a Place, associated with an Observation.
domainIncludes: Observation
source: https://github.com/schemaorg/schemaorg/issues/2291
rangeIncludes: Place
rangeIncludes: Thing
isPartOf: pending.schema.org

targetPlatform
type: Property
comment: Type of app development: phone, Metro style, desktop, XBox, etc.
domainIncludes: APIReference
rangeIncludes: Text

OTC
type: DrugPrescriptionStatus
comment: The character of a medical substance, typically a medicine, of being available over the counter or not.
isPartOf: health-lifesci.schema.org

Ultrasound
type: MedicalImagingTechnique
isPartOf: health-lifesci.schema.org
comment: Ultrasound imaging.

ItemListUnordered
type: ItemListOrderType
comment: An ItemList ordered with no explicit order.

code
type: Property
domainIncludes: MedicalEntity
rangeIncludes: MedicalCode
comment: A medical code for the entity, taken from a controlled vocabulary or ontology such as ICD-9, DiseasesDB, MeSH, SNOMED-CT, RxNorm, etc.
isPartOf: health-lifesci.schema.org

Table
type: Class
subclass of: WebPageElement
comment: A table on a Web page.

abstract
type: Property
comment: An abstract is a short description that summarizes a CreativeWork.
source: https://github.com/schemaorg/schemaorg/issues/276
domainIncludes: CreativeWork
isPartOf: pending.schema.org
rangeIncludes: Text

broadcastServiceTier
type: Property
comment: The type of service required to have access to the channel (e.g. Standard or Premium).
domainIncludes: BroadcastChannel
rangeIncludes: Text

unsaturatedFatContent
type: Property
rangeIncludes: Mass
comment: The number of grams of unsaturated fat.
domainIncludes: NutritionInformation

costOrigin
type: Property
isPartOf: health-lifesci.schema.org
comment: Additional details to capture the origin of the cost data. For example, 'Medicare Part B'.
domainIncludes: DrugCost
rangeIncludes: Text

unitText
type: Property
domainIncludes: UnitPriceSpecification
domainIncludes: PropertyValue
domainIncludes: TypeAndQuantityNode
domainIncludes: QuantitativeValue
rangeIncludes: Text
comment: A string or text indicating the unit of measurement. Useful if you cannot provide a standard unit code for unitCode.

assembly
type: Property
supersededBy: executableLibraryName
comment: Library file name, e.g., mscorlib.dll, system.web.dll.
rangeIncludes: Text
domainIncludes: APIReference

executableLibraryName
type: Property
comment: Library file name, e.g., mscorlib.dll, system.web.dll.
rangeIncludes: Text
domainIncludes: APIReference

arrivalBusStop
type: Property
rangeIncludes: BusStop
rangeIncludes: BusStation
domainIncludes: BusTrip
comment: The stop or station from which the bus arrives.

Reservoir
type: Class
comment: A reservoir of water, typically an artificially created lake, like the Lake Kariba reservoir.
subclass of: BodyOfWater

PreOrderAction
type: Class
comment: An agent orders a (not yet released) object/product/service to be delivered/sent.
subclass of: TradeAction
source: https://github.com/schemaorg/schemaorg/issues/1125

color
type: Property
comment: The color of the product.
contributor: GoodRelationsTerms
equivalent property: colourDescription
rangeIncludes: Text
domainIncludes: Product

Nonprofit501c23
type: USNonprofitType
comment: Nonprofit501c23: Non-profit type referring to Veterans Organizations.
isPartOf: pending.schema.org
source: https://github.com/schemaorg/schemaorg/issues/2543

practicesAt
type: Property
source: https://github.com/schemaorg/schemaorg/issues/3420
rangeIncludes: MedicalOrganization
isPartOf: pending.schema.org
domainIncludes: IndividualPhysician
comment: A MedicalOrganization where the IndividualPhysician practices.

CassetteFormat
type: MusicReleaseFormatType
comment: CassetteFormat.
contributor: MBZ

maximumVirtualAttendeeCapacity
type: Property
source: https://github.com/schemaorg/schemaorg/issues/1842
domainIncludes: Event
rangeIncludes: Integer
isPartOf: pending.schema.org
comment: The maximum virtual attendee capacity of an Event whose eventAttendanceMode is OnlineEventAttendanceMode (or the online aspects, in the case of a MixedEventAttendanceMode).

geoCoveredBy
type: Property
rangeIncludes: GeospatialGeometry
rangeIncludes: Place
domainIncludes: Place
domainIncludes: GeospatialGeometry
comment: Represents a relationship between two geometries (or the places they represent), relating a geometry to another that covers it. As defined in [DE-9IM](https://en.wikipedia.org/wiki/DE-9IM).

ScreeningHealthAspect
type: HealthAspectEnumeration
isPartOf: pending.schema.org
source: https://github.com/schemaorg/schemaorg/issues/2374
comment: Content about how to screen or further filter a topic.

iso6523Code
type: Property
isPartOf: pending.schema.org
domainIncludes: Organization
comment: An organization identifier as defined in [ISO 6523(-1)](https://en.wikipedia.org/wiki/ISO/IEC_6523). The identifier should be in the `XXXX:YYYYYY:ZZZ` or `XXXX:YYYYYY`format. Where `XXXX` is a 4 digit _ICD_ (International Code Designator), `YYYYYY` is an _OID_ (Organization Identifier) with all formatting characters (dots, dashes, spaces) removed with a maximal length of 35 characters, and `ZZZ` is an optional OPI (Organization Part Identifier) with a maximum length of 35 characters. The various components (ICD, OID, OPI) are joined with a colon character (ASCII `0x3a`). Note that many existing organization identifiers defined as attributes like [leiCode](http://schema.org/leiCode) (`0199`), [duns](http://schema.org/duns) (`0060`) or [GLN](http://schema.org/globalLocationNumber) (`0088`) can be expressed using ISO-6523. If possible, ISO-6523 codes should be preferred to populating [vatID](http://schema.org/vatID) or [taxID](http://schema.org/taxID), as ISO identifiers are less ambiguous.
source: https://github.com/schemaorg/schemaorg/issues/2915
rangeIncludes: Text

isrcCode
type: Property
domainIncludes: MusicRecording
comment: The International Standard Recording Code for the recording.
contributor: MBZ
rangeIncludes: Text

contentUrl
type: Property
domainIncludes: MediaObject
comment: Actual bytes of the media object, for example the image file or video file.
rangeIncludes: URL

DanceGroup
type: Class
comment: A dance group—for example, the Alvin Ailey Dance Theater or Riverdance.
subclass of: PerformingGroup

GroupBoardingPolicy
type: BoardingPolicyType
comment: The airline boards by groups based on check-in time, priority, etc.

postalCodeRange
type: Property
rangeIncludes: PostalCodeRangeSpecification
domainIncludes: DefinedRegion
comment: A defined range of postal codes.
source: https://github.com/schemaorg/schemaorg/issues/2506

incentiveAmount
type: Property
rangeIncludes: LoanOrCredit
rangeIncludes: UnitPriceSpecification
rangeIncludes: QuantitativeValue
isPartOf: pending.schema.org
source: https://github.com/schemaorg/schemaorg/issues/3572
domainIncludes: FinancialIncentive
comment: Describes the amount that can be redeemed from this incentive. QuantitativeValue: Use this for incentives based on price (either raw amount or percentage-based). For a raw amount example, "You can claim $2,500 - $7,500 from the total cost of installation" would be represented as the following: { "@type": "QuantitativeValue", “minValue”: 2500, “maxValue”: 7500, "unitCode": "USD" } QuantitivateValue can also be used for percentage amounts. In such cases, value is used to represent the incentive’s percentage, while maxValue represents a limit (if one exists) to that incentive. The unitCode should be 'P1' and the unitText should be '%', while valueReference should be used for holding the currency type. For example, "You can claim up to 30% of the total cost of installation, up to a maximum of $7,500" would be: { "@type": "QuantitativeValue", "value": 30, "unitCode": "P1", "unitText": "%", “maxValue”: 7500, “valueReference”: “USD” } UnitPriceSpecification: Use this for incentives that are based on amounts rather than price. For example, a net metering rebate that pays $10/kWh, up to $1,000: { "@type": "UnitPriceSpecification", "price": 10, "priceCurrency": "USD", "referenceQuantity": 1, "unitCode": "DO3", "unitText": "kw/h", "maxPrice": 1000, "description": "$10 / kwh up to $1000" } LoanOrCredit: Use for incentives that are loan based. For example, a loan of $4,000 - $50,000 with a repayment term of 10 years, interest free would look like: { "@type": "LoanOrCredit", "loanTerm": { "@type":"QuantitativeValue", "value":"10", "unitCode": "ANN" }, "amount":[ { "@type": "QuantitativeValue", "Name":"fixed interest rate", "value":"0", }, ], "amount":[ { "@type": "MonetaryAmount", "Name":"min loan amount", "value":"4000", "currency":"CAD" }, { "@type": "MonetaryAmount", "Name":"max loan amount", "value":"50000", "currency":"CAD" } ], } In summary: Use QuantitativeValue for absolute/percentage-based incentives applied on the price of a good/service. Use [[UnitP…

Winery
type: Class
subclass of: FoodEstablishment
comment: A winery.

TheaterGroup
type: Class
subclass of: PerformingGroup
comment: A theater group or company, for example, the Royal Shakespeare Company or Druid Theatre.

HearingImpairedSupported
type: ContactPointOption
comment: Uses devices to support users with hearing impairments.

hasMemberProgram
type: Property
rangeIncludes: MemberProgram
source: https://github.com/schemaorg/schemaorg/issues/3563
comment: MemberProgram offered by an Organization, for example an eCommerce merchant or an airline.
domainIncludes: Organization

Wednesday
type: DayOfWeek
comment: The day of the week between Tuesday and Thursday.

AerobicActivity
type: PhysicalActivityCategory
isPartOf: health-lifesci.schema.org
comment: Physical activity of relatively low intensity that depends primarily on the aerobic energy-generating process; during activity, the aerobic metabolism uses oxygen to adequately meet energy demands during exercise.

BodyMeasurementInsideLeg
type: BodyMeasurementTypeEnumeration
comment: Inside leg (measured between crotch and soles of feet). Used, for example, to fit pants.
source: https://github.com/schemaorg/schemaorg/issues/2811
isPartOf: pending.schema.org

lodgingUnitType
type: Property
rangeIncludes: QualitativeValue
rangeIncludes: Text
comment: Textual description of the unit type (including suite vs. room, size of bed, etc.).
domainIncludes: LodgingReservation

cvdFacilityId
type: Property
source: https://github.com/schemaorg/schemaorg/issues/2521
rangeIncludes: Text
comment: Identifier of the NHSN facility that this data record applies to. Use cvdFacilityCounty to indicate the county. To provide other details, healthcareReportingData can be used on a Hospital entry.
domainIncludes: CDCPMDRecord
isPartOf: pending.schema.org

WearableSizeSystemCN
type: WearableSizeSystemEnumeration
source: https://github.com/schemaorg/schemaorg/issues/2811
comment: Chinese size system for wearables.
isPartOf: pending.schema.org

recipeYield
type: Property
domainIncludes: Recipe
rangeIncludes: QuantitativeValue
rangeIncludes: Text
comment: The quantity produced by the recipe (for example, number of people served, number of servings, etc).
sub property of: yield

yield
type: Property
rangeIncludes: QuantitativeValue
rangeIncludes: Text
comment: The quantity that results by performing instructions. For example, a paper airplane, 10 personalized candles.
domainIncludes: HowTo

prescribingInfo
type: Property
domainIncludes: Drug
comment: Link to prescribing information for the drug.
isPartOf: health-lifesci.schema.org
rangeIncludes: URL

acceptsReservations
type: Property
domainIncludes: FoodEstablishment
rangeIncludes: Boolean
rangeIncludes: URL
rangeIncludes: Text
comment: Indicates whether a FoodEstablishment accepts reservations. Values can be Boolean, an URL at which reservations can be made or (for backwards compatibility) the strings ```Yes``` or ```No```.

hasHealthAspect
type: Property
domainIncludes: HealthTopicContent
isPartOf: pending.schema.org
source: https://github.com/schemaorg/schemaorg/issues/2373
rangeIncludes: HealthAspectEnumeration
comment: Indicates the aspect or aspects specifically addressed in some HealthTopicContent. For example, that the content is an overview, or that it talks about treatment, self-care, treatments or their side-effects.

awayTeam
type: Property
comment: The away team in a sports event.
rangeIncludes: SportsTeam
rangeIncludes: Person
sub property of: competitor
domainIncludes: SportsEvent

Nonprofit501c22
type: USNonprofitType
source: https://github.com/schemaorg/schemaorg/issues/2543
comment: Nonprofit501c22: Non-profit type referring to Withdrawal Liability Payment Funds.
isPartOf: pending.schema.org

Sunday
type: DayOfWeek
comment: The day of the week between Saturday and Monday.

video
type: Property
rangeIncludes: VideoObject
rangeIncludes: Clip
comment: An embedded video object.
domainIncludes: CreativeWork

printEdition
type: Property
comment: The edition of the print product in which the NewsArticle appears.
domainIncludes: NewsArticle
rangeIncludes: Text

DamagedCondition
type: OfferItemCondition
comment: Indicates that the item is damaged.

Hackathon
type: Class
subclass of: Event
comment: A [hackathon](https://en.wikipedia.org/wiki/Hackathon) event.
source: https://github.com/schemaorg/schemaorg/issues/2526
isPartOf: pending.schema.org

EventRescheduled
type: EventStatusType
comment: The event has been rescheduled. The event's previousStartDate should be set to the old date and the startDate should be set to the event's new date. (If the event has been rescheduled multiple times, the previousStartDate property may be repeated.)

instructor
type: Property
rangeIncludes: Person
domainIncludes: CourseInstance
comment: A person assigned to instruct or provide instructional assistance for the CourseInstance.

merchant
type: Property
domainIncludes: Order
comment: 'merchant' is an out-dated term for 'seller'.
supersededBy: seller
rangeIncludes: Person
rangeIncludes: Organization

hasOfferCatalog
type: Property
rangeIncludes: OfferCatalog
comment: Indicates an OfferCatalog listing for this Organization, Person, or Service.
domainIncludes: Service
domainIncludes: Person
domainIncludes: Organization

Nonprofit501c5
type: USNonprofitType
comment: Nonprofit501c5: Non-profit type referring to Labor, Agricultural and Horticultural Organizations.
isPartOf: pending.schema.org
source: https://github.com/schemaorg/schemaorg/issues/2543

Rheumatologic
type: MedicalSpecialty
comment: A specific branch of medical science that deals with the study and treatment of rheumatic, autoimmune or joint diseases.
isPartOf: health-lifesci.schema.org

fuelEfficiency
type: Property
rangeIncludes: QuantitativeValue
domainIncludes: Vehicle
comment: The distance traveled per unit of fuel used; most commonly miles per gallon (mpg) or kilometers per liter (km/L).\n\n* Note 1: There are unfortunately no standard unit codes for miles per gallon or kilometers per liter. Use unitText to indicate the unit of measurement, e.g. mpg or km/L.\n* Note 2: There are two ways of indicating the fuel consumption, fuelConsumption (e.g. 8 liters per 100 km) and fuelEfficiency (e.g. 30 miles per gallon). They are reciprocal.\n* Note 3: Often, the absolute value is useful only when related to driving speed ("at 80 km/h") or usage pattern ("city traffic"). You can use valueReference to link the value for the fuel economy to another value.
contributor: Automotive Ontology Working Group

itinerary
type: Property
contributor: Tourism
isPartOf: pending.schema.org
source: https://github.com/schemaorg/schemaorg/issues/1810
rangeIncludes: Place
rangeIncludes: ItemList
domainIncludes: Trip
comment: Destination(s) ( Place ) that make up a trip. For a trip where destination order is important use ItemList to specify that order (see examples).

totalTime
type: Property
domainIncludes: HowToDirection
domainIncludes: HowTo
rangeIncludes: Duration
comment: The total time required to perform instructions or a direction (including time to prepare the supplies), in [ISO 8601 duration format](http://en.wikipedia.org/wiki/ISO_8601).

SingleBlindedTrial
type: MedicalTrialDesign
isPartOf: health-lifesci.schema.org
comment: A trial design in which the researcher knows which treatment the patient was randomly assigned to but the patient does not.

jobImmediateStart
type: Property
domainIncludes: JobPosting
source: https://github.com/schemaorg/schemaorg/issues/2244
isPartOf: pending.schema.org
comment: An indicator as to whether a position is available for an immediate start.
rangeIncludes: Boolean

TheaterEvent
type: Class
comment: Event type: Theater performance.
subclass of: Event

text
type: Property
domainIncludes: CreativeWork
rangeIncludes: Text
comment: The textual content of this CreativeWork.

AndroidPlatform
type: DigitalPlatformEnumeration
isPartOf: pending.schema.org
source: https://github.com/schemaorg/schemaorg/issues/3057
comment: Represents the broad notion of Android-based operating systems.

valueMaxLength
type: Property
comment: Specifies the allowed range for number of characters in a literal value.
domainIncludes: PropertyValueSpecification
rangeIncludes: Number

programName
type: Property
domainIncludes: ProgramMembership
comment: The program providing the membership. It is preferable to use [:program](http://schema.org/program) instead.
rangeIncludes: Text

application
type: Property
rangeIncludes: SoftwareApplication
supersededBy: actionApplication
comment: An application that can complete the request.
domainIncludes: EntryPoint

actionApplication
type: Property
domainIncludes: EntryPoint
rangeIncludes: SoftwareApplication
comment: An application that can complete the request.

orderPercentage
type: Property
isPartOf: pending.schema.org
domainIncludes: ShippingRateSettings
comment: Value in the range [0.0 ; 1.0] representing the fraction of the value of the order that is charged as shipping cost.
source: https://github.com/schemaorg/schemaorg/issues/3617
rangeIncludes: Number

colleagues
type: Property
comment: A colleague of the person.
supersededBy: colleague
domainIncludes: Person
rangeIncludes: Person

colleague
type: Property
rangeIncludes: Person
rangeIncludes: URL
domainIncludes: Person
comment: A colleague of the person.

PostOffice
type: Class
comment: A post office.
subclass of: GovernmentOffice

LegislativeBuilding
type: Class
subclass of: GovernmentBuilding
comment: A legislative building—for example, the state capitol.

Bone
type: Class
subclass of: AnatomicalStructure
isPartOf: health-lifesci.schema.org
comment: Rigid connective tissue that comprises up the skeletal structure of the human body.

cvdNumC19MechVentPats
type: Property
source: https://github.com/schemaorg/schemaorg/issues/2521
rangeIncludes: Number
domainIncludes: CDCPMDRecord
comment: numc19mechventpats - HOSPITALIZED and VENTILATED: Patients hospitalized in an NHSN inpatient care location who have suspected or confirmed COVID-19 and are on a mechanical ventilator.
isPartOf: pending.schema.org

ByInvoice
type: PaymentMethodType
comment: Payment by invoice, typically after the goods were delivered, equivalent to http://purl.org/goodrelations/v1#ByInvoice.

characterName
type: Property
rangeIncludes: Text
comment: The name of a character played in some acting or performing role, i.e. in a PerformanceRole.
domainIncludes: PerformanceRole

salaryCurrency
type: Property
domainIncludes: JobPosting
domainIncludes: EmployeeRole
rangeIncludes: Text
comment: The currency (coded using [ISO 4217](http://en.wikipedia.org/wiki/ISO_4217)) used for the main salary information in this job posting or for this employee.

EUEnergyEfficiencyCategoryA1Plus
type: EUEnergyEfficiencyEnumeration
isPartOf: pending.schema.org
source: https://github.com/schemaorg/schemaorg/issues/2670
comment: Represents EU Energy Efficiency Class A+ as defined in EU energy labeling regulations.

RestockingFees
type: ReturnFeesEnumeration
source: https://github.com/schemaorg/schemaorg/issues/2288
comment: Specifies that the customer must pay a restocking fee when returning a product.
isPartOf: pending.schema.org

benefitsSummaryUrl
type: Property
comment: The URL that goes directly to the summary of benefits and coverage for the specific standard plan or plan variation.
source: https://github.com/schemaorg/schemaorg/issues/1062
rangeIncludes: URL
domainIncludes: HealthInsurancePlan
isPartOf: pending.schema.org

targetPopulation
type: Property
comment: Characteristics of the population for which this is intended, or which typically uses it, e.g. 'adults'.
rangeIncludes: Text
domainIncludes: DietarySupplement
domainIncludes: DoseSchedule
isPartOf: health-lifesci.schema.org

Appearance
type: PhysicalExam
comment: Appearance assessment with clinical examination.
isPartOf: health-lifesci.schema.org

FulfillmentTypeDelivery
type: FulfillmentTypeEnumeration
isPartOf: pending.schema.org
comment: Fulfillment to a customer selected address.
source: https://github.com/schemaorg/schemaorg/issues/3617

lender
type: Property
comment: A sub property of participant. The person that lends the object being borrowed.
sub property of: participant
rangeIncludes: Organization
rangeIncludes: Person
domainIncludes: BorrowAction

WearableSizeGroupInfants
type: WearableSizeGroupEnumeration
comment: Size group "Infants" for wearables.
source: https://github.com/schemaorg/schemaorg/issues/2811
isPartOf: pending.schema.org

deliveryStatus
type: Property
comment: New entry added as the package passes through each leg of its journey (from shipment to final delivery).
domainIncludes: ParcelDelivery
rangeIncludes: DeliveryEvent

numChildren
type: Property
rangeIncludes: QuantitativeValue
rangeIncludes: Integer
domainIncludes: LodgingReservation
comment: The number of children staying in the unit.

Wholesale
type: DrugCostCategory
isPartOf: health-lifesci.schema.org
comment: The drug's cost represents the wholesale acquisition cost of the drug.

ActivationFee
type: PriceComponentTypeEnumeration
isPartOf: pending.schema.org
source: https://github.com/schemaorg/schemaorg/issues/2689
comment: Represents the activation fee part of the total price for an offered product, for example a cellphone contract.

WearableSizeGroupPetite
type: WearableSizeGroupEnumeration
source: https://github.com/schemaorg/schemaorg/issues/2811
comment: Size group "Petite" for wearables.
isPartOf: pending.schema.org

BodyMeasurementFoot
type: BodyMeasurementTypeEnumeration
source: https://github.com/schemaorg/schemaorg/issues/2811
comment: Foot length (measured between end of the most prominent toe and the most prominent part of the heel). Used, for example, to measure socks.
isPartOf: pending.schema.org

Balance
type: PhysicalActivityCategory
isPartOf: health-lifesci.schema.org
comment: Physical activity that is engaged to help maintain posture and balance.

gtin8
type: Property
domainIncludes: Product
domainIncludes: Demand
domainIncludes: Offer
rangeIncludes: Text
comment: The GTIN-8 code of the product, or the product to which the offer refers. This code is also known as EAN/UCC-8 or 8-digit EAN. See [GS1 GTIN Summary](http://www.gs1.org/barcodes/technical/idkeys/gtin) for more details.
sub property of: gtin
sub property of: identifier
contributor: GoodRelationsTerms

measurementDenominator
type: Property
domainIncludes: Observation
domainIncludes: StatisticalVariable
isPartOf: pending.schema.org
rangeIncludes: StatisticalVariable
source: https://github.com/schemaorg/schemaorg/issues/2564
comment: Identifies the denominator variable when an observation represents a ratio or percentage.

TobaccoNicotineConsideration
type: AdultOrientedEnumeration
isPartOf: pending.schema.org
comment: Item contains tobacco and/or nicotine, for example cigars, cigarettes, chewing tobacco, e-cigarettes, or hookahs.
source: https://github.com/schemaorg/schemaorg/issues/2989

Float
type: Class
comment: Data type: Floating number.
subclass of: Number

VideoObjectSnapshot
type: Class
comment: A specific and exact (byte-for-byte) version of a VideoObject. Two byte-for-byte identical files, for the purposes of this type, considered identical. If they have different embedded metadata the files will differ. Different external facts about the files, e.g. creator or dateCreated that aren't represented in their actual content, do not affect this notion of identity.
source: https://github.com/schemaorg/schemaorg/issues/2450
subclass of: VideoObject
isPartOf: pending.schema.org

Nonprofit501c4
type: USNonprofitType
isPartOf: pending.schema.org
comment: Nonprofit501c4: Non-profit type referring to Civic Leagues, Social Welfare Organizations, and Local Associations of Employees.
source: https://github.com/schemaorg/schemaorg/issues/2543

transcript
type: Property
comment: If this MediaObject is an AudioObject or VideoObject, the transcript of that object.
rangeIncludes: Text
domainIncludes: VideoObject
domainIncludes: AudioObject

equal
type: Property
domainIncludes: QualitativeValue
rangeIncludes: QualitativeValue
comment: This ordering relation for qualitative values indicates that the subject is equal to the object.
contributor: GoodRelationsTerms

LaboratoryScience
type: MedicalSpecialty
isPartOf: health-lifesci.schema.org
comment: A medical science pertaining to chemical, hematological, immunologic, microscopic, or bacteriological diagnostic analyses or research.

Synagogue
type: Class
subclass of: PlaceOfWorship
comment: A synagogue.

antagonist
type: Property
comment: The muscle whose action counteracts the specified muscle.
domainIncludes: Muscle
isPartOf: health-lifesci.schema.org
rangeIncludes: Muscle

GardenStore
type: Class
comment: A garden store.
subclass of: Store

validUntil
type: Property
domainIncludes: Permit
rangeIncludes: Date
comment: The date when the item is no longer valid.

mentions
type: Property
comment: Indicates that the CreativeWork contains a reference to, but is not necessarily about a concept.
domainIncludes: CreativeWork
rangeIncludes: Thing

MultiCenterTrial
type: MedicalTrialDesign
comment: A trial that takes place at multiple centers.
isPartOf: health-lifesci.schema.org

pregnancyCategory
type: Property
domainIncludes: Drug
rangeIncludes: DrugPregnancyCategory
comment: Pregnancy category of this drug.
isPartOf: health-lifesci.schema.org

userInteractionCount
type: Property
comment: The number of interactions for the CreativeWork using the WebSite or SoftwareApplication.
rangeIncludes: Integer
domainIncludes: InteractionCounter

remainingAttendeeCapacity
type: Property
comment: The number of attendee places for an event that remain unallocated.
domainIncludes: Event
rangeIncludes: Integer

TireShop
type: Class
comment: A tire shop.
subclass of: Store

IncentiveQualifiedExpenseTypeUtilityBill
type: IncentiveQualifiedExpenseType
source: https://github.com/schemaorg/schemaorg/issues/3572
isPartOf: pending.schema.org
comment: This incentive applies to utility bills.

ComedyClub
type: Class
comment: A comedy club.
subclass of: EntertainmentBusiness

VisualArtsEvent
type: Class
subclass of: Event
comment: Event type: Visual arts event.

physiologicalBenefits
type: Property
comment: Specific physiologic benefits associated to the plan.
isPartOf: health-lifesci.schema.org
domainIncludes: Diet
rangeIncludes: Text

polygon
type: Property
comment: A polygon is the area enclosed by a point-to-point path for which the starting and ending points are the same. A polygon is expressed as a series of four or more space delimited points where the first and final points are identical.
rangeIncludes: Text
domainIncludes: GeoShape

Throat
type: PhysicalExam
comment: Throat assessment with clinical examination.
isPartOf: health-lifesci.schema.org

OfferForLease
type: Class
source: https://github.com/schemaorg/schemaorg/issues/2348
comment: An OfferForLease in Schema.org represents an Offer to lease out something, i.e. an Offer whose businessFunction is [lease out](http://purl.org/goodrelations/v1#LeaseOut.). See [Good Relations](https://en.wikipedia.org/wiki/GoodRelations) for background on the underlying concepts.
subclass of: Offer
isPartOf: pending.schema.org

ReducedRelevanceForChildrenConsideration
type: AdultOrientedEnumeration
source: https://github.com/schemaorg/schemaorg/issues/2989
isPartOf: pending.schema.org
comment: A general code for cases where relevance to children is reduced, e.g. adult education, mortgages, retirement-related products, etc.

WearableSizeSystemEN13402
type: WearableSizeSystemEnumeration
source: https://github.com/schemaorg/schemaorg/issues/2811
isPartOf: pending.schema.org
comment: EN 13402 (joint European standard for size labelling of clothes).

permissions
type: Property
rangeIncludes: Text
comment: Permission(s) required to run the app (for example, a mobile app may require full internet access or may run only on wifi).
domainIncludes: SoftwareApplication

Therapeutic
type: MedicalDevicePurpose
isPartOf: health-lifesci.schema.org
comment: A medical device used for therapeutic purposes.

includedComposition
type: Property
contributor: MBZ
rangeIncludes: MusicComposition
comment: Smaller compositions included in this work (e.g. a movement in a symphony).
domainIncludes: MusicComposition

merchantReturnDays
type: Property
rangeIncludes: Date
rangeIncludes: Integer
rangeIncludes: DateTime
isPartOf: pending.schema.org
domainIncludes: MerchantReturnPolicySeasonalOverride
domainIncludes: MerchantReturnPolicy
source: https://github.com/schemaorg/schemaorg/issues/2288
comment: Specifies either a fixed return date or the number of days (from the delivery date) that a product can be returned. Used when the returnPolicyCategory property is specified as MerchantReturnFiniteReturnWindow.

FourWheelDriveConfiguration
type: DriveWheelConfigurationValue
comment: Four-wheel drive is a transmission layout where the engine primarily drives two wheels with a part-time four-wheel drive capability.
contributor: Automotive Ontology Working Group

Subscription
type: PriceComponentTypeEnumeration
isPartOf: pending.schema.org
comment: Represents the subscription pricing component of the total price for an offered product.
source: https://github.com/schemaorg/schemaorg/issues/2689

contentReferenceTime
type: Property
domainIncludes: CreativeWork
comment: The specific time described by a creative work, for works (e.g. articles, video objects etc.) that emphasise a particular moment within an Event.
isPartOf: pending.schema.org
rangeIncludes: DateTime
source: https://github.com/schemaorg/schemaorg/issues/1050

learningResourceType
type: Property
rangeIncludes: Text
rangeIncludes: DefinedTerm
domainIncludes: CreativeWork
domainIncludes: LearningResource
comment: The predominant type or kind characterizing the learning resource. For example, 'presentation', 'handout'.

FailedActionStatus
type: ActionStatusType
comment: An action that failed to complete. The action's error property and the HTTP return code contain more information about the failure.

Ear
type: PhysicalExam
comment: Ear function assessment with clinical examination.
isPartOf: health-lifesci.schema.org

diagnosis
type: Property
domainIncludes: DDxElement
domainIncludes: Patient
rangeIncludes: MedicalCondition
isPartOf: health-lifesci.schema.org
comment: One or more alternative conditions considered in the differential diagnosis process as output of a diagnosis process.

PrependAction
type: Class
comment: The act of inserting at the beginning if an ordered collection.
subclass of: InsertAction

EventVenue
type: Class
comment: An event venue.
subclass of: CivicStructure

UnRegisterAction
type: Class
comment: The act of un-registering from a service.\n\nRelated actions:\n\n* RegisterAction: antonym of UnRegisterAction.\n* LeaveAction: Unlike LeaveAction, UnRegisterAction implies that you are unregistering from a service you were previously registered, rather than leaving a team/group of people.
subclass of: InteractAction

trackingNumber
type: Property
rangeIncludes: Text
comment: Shipper tracking number.
domainIncludes: ParcelDelivery

SeeDoctorHealthAspect
type: HealthAspectEnumeration
isPartOf: pending.schema.org
source: https://github.com/schemaorg/schemaorg/issues/2374
comment: Information about questions that may be asked, when to see a professional, measures before seeing a doctor or content about the first consultation.

FDAcategoryC
type: DrugPregnancyCategory
comment: A designation by the US FDA signifying that animal reproduction studies have shown an adverse effect on the fetus and there are no adequate and well-controlled studies in humans, but potential benefits may warrant use of the drug in pregnant women despite potential risks.
isPartOf: health-lifesci.schema.org

educationalFramework
type: Property
rangeIncludes: Text
domainIncludes: AlignmentObject
comment: The framework to which the resource being described is aligned.

AnimalShelter
type: Class
subclass of: LocalBusiness
comment: Animal shelter.

comprisedOf
type: Property
rangeIncludes: AnatomicalStructure
rangeIncludes: AnatomicalSystem
domainIncludes: AnatomicalSystem
comment: Specifying something physically contained by something else. Typically used here for the underlying anatomical structures, such as organs, that comprise the anatomical system.
isPartOf: health-lifesci.schema.org

softwareHelp
type: Property
comment: Software application help.
rangeIncludes: CreativeWork
domainIncludes: SoftwareApplication

steeringPosition
type: Property
domainIncludes: Vehicle
comment: The position of the steering wheel or similar device (mostly for cars).
rangeIncludes: SteeringPositionValue
contributor: Automotive Ontology Working Group

RefurbishedCondition
type: OfferItemCondition
comment: Indicates that the item is refurbished.

advanceBookingRequirement
type: Property
domainIncludes: Demand
domainIncludes: Offer
rangeIncludes: QuantitativeValue
contributor: GoodRelationsTerms
comment: The amount of time that is required between accepting the offer and the actual usage of the resource or service.

fatContent
type: Property
rangeIncludes: Mass
comment: The number of grams of fat.
domainIncludes: NutritionInformation

permitAudience
type: Property
domainIncludes: Permit
comment: The target audience for this permit.
rangeIncludes: Audience

events
type: Property
domainIncludes: Place
domainIncludes: Organization
comment: Upcoming or past events associated with this place or organization.
rangeIncludes: Event
supersededBy: event

event
type: Property
domainIncludes: JoinAction
domainIncludes: InformAction
domainIncludes: LeaveAction
domainIncludes: InviteAction
domainIncludes: Place
domainIncludes: Organization
domainIncludes: PlayAction
comment: Upcoming or past event associated with this place, organization, or action.
rangeIncludes: Event

QAPage
type: Class
subclass of: WebPage
comment: A QAPage is a WebPage focussed on a specific Question and its Answer(s), e.g. in a question answering site or documenting Frequently Asked Questions (FAQs).

eligibleCustomerType
type: Property
comment: The type(s) of customers for which the given offer is valid.
domainIncludes: Demand
domainIncludes: Offer
contributor: GoodRelationsTerms
rangeIncludes: BusinessEntityType

discountCurrency
type: Property
rangeIncludes: Text
domainIncludes: Order
comment: The currency of the discount.\n\nUse standard formats: [ISO 4217 currency format](http://en.wikipedia.org/wiki/ISO_4217), e.g. "USD"; [Ticker symbol](https://en.wikipedia.org/wiki/List_of_cryptocurrencies) for cryptocurrencies, e.g. "BTC"; well known names for [Local Exchange Trading Systems](https://en.wikipedia.org/wiki/Local_exchange_trading_system) (LETS) and other currency types, e.g. "Ithaca HOUR".

DryCleaningOrLaundry
type: Class
comment: A dry-cleaning business.
subclass of: LocalBusiness

affectedBy
type: Property
rangeIncludes: Drug
comment: Drugs that affect the test's results.
isPartOf: health-lifesci.schema.org
domainIncludes: MedicalTest

Drawing
type: Class
isPartOf: pending.schema.org
source: https://github.com/schemaorg/schemaorg/issues/1448
comment: A picture or diagram made with a pencil, pen, or crayon rather than paint.
subclass of: CreativeWork

CompositeSyntheticDigitalSource
type: IPTCDigitalSourceEnumeration
comment: Content coded as 'composite synthetic' using the IPTC digital source type vocabulary.
isPartOf: pending.schema.org
source: https://github.com/schemaorg/schemaorg/issues/3392

cutoffTime
type: Property
rangeIncludes: Time
comment: Order cutoff time allows merchants to describe the time after which they will no longer process orders received on that day. For orders processed after cutoff time, one day gets added to the delivery time estimate. This property is expected to be most typically used via the ShippingRateSettings publication pattern. The time is indicated using the ISO-8601 Time format, e.g. "23:30:00-05:00" would represent 6:30 pm Eastern Standard Time (EST) which is 5 hours behind Coordinated Universal Time (UTC).
domainIncludes: ServicePeriod
domainIncludes: ShippingDeliveryTime
source: https://github.com/schemaorg/schemaorg/issues/2506
source: https://github.com/schemaorg/schemaorg/issues/3617

screenshot
type: Property
rangeIncludes: ImageObject
rangeIncludes: URL
domainIncludes: SoftwareApplication
comment: A link to a screenshot image of the app.

AllWheelDriveConfiguration
type: DriveWheelConfigurationValue
comment: All-wheel Drive is a transmission layout where the engine drives all four wheels.
contributor: Automotive Ontology Working Group

endorsers
type: Property
isPartOf: health-lifesci.schema.org
rangeIncludes: Person
rangeIncludes: Organization
domainIncludes: Diet
comment: People or organizations that endorse the plan.

FDAcategoryX
type: DrugPregnancyCategory
comment: A designation by the US FDA signifying that studies in animals or humans have demonstrated fetal abnormalities and/or there is positive evidence of human fetal risk based on adverse reaction data from investigational or marketing experience, and the risks involved in use of the drug in pregnant women clearly outweigh potential benefits.
isPartOf: health-lifesci.schema.org

numTracks
type: Property
rangeIncludes: Integer
domainIncludes: MusicPlaylist
comment: The number of tracks in this album or playlist.

adverseOutcome
type: Property
comment: A possible complication and/or side effect of this therapy. If it is known that an adverse outcome is serious (resulting in death, disability, or permanent damage; requiring hospitalization; or otherwise life-threatening or requiring immediate medical attention), tag it as a seriousAdverseOutcome instead.
domainIncludes: TherapeuticProcedure
domainIncludes: MedicalDevice
rangeIncludes: MedicalEntity
isPartOf: health-lifesci.schema.org

shippingDetails
type: Property
source: https://github.com/schemaorg/schemaorg/issues/2506
domainIncludes: Offer
rangeIncludes: OfferShippingDetails
comment: Indicates information about the shipping policies and options associated with an Offer.

healthPlanCopayOption
type: Property
comment: Whether the copay is before or after deductible, etc. TODO: Is this a closed set?
rangeIncludes: Text
isPartOf: pending.schema.org
domainIncludes: HealthPlanCostSharingSpecification
source: https://github.com/schemaorg/schemaorg/issues/1062

Pond
type: Class
comment: A pond.
subclass of: BodyOfWater

CancelAction
type: Class
comment: The act of asserting that a future event/action is no longer going to happen.\n\nRelated actions:\n\n* ConfirmAction: The antonym of CancelAction.
subclass of: PlanAction

departureAirport
type: Property
comment: The airport where the flight originates.
rangeIncludes: Airport
domainIncludes: Flight

SinglePlayer
type: GamePlayMode
comment: Play mode: SinglePlayer. Which is played by a lone player.

Eye
type: PhysicalExam
isPartOf: health-lifesci.schema.org
comment: Eye or ophthalmological function assessment with clinical examination.

LandmarksOrHistoricalBuildings
type: Class
comment: An historical landmark or building.
subclass of: Place

BarOrPub
type: Class
subclass of: FoodEstablishment
comment: A bar or pub.

originatesFrom
type: Property
comment: The vasculature the lymphatic structure originates, or afferents, from.
rangeIncludes: Vessel
domainIncludes: LymphaticVessel
isPartOf: health-lifesci.schema.org

AppendAction
type: Class
comment: The act of inserting at the end if an ordered collection.
subclass of: InsertAction

AutoRental
type: Class
comment: A car rental business.
subclass of: AutomotiveBusiness

requiredMaxAge
type: Property
rangeIncludes: Integer
domainIncludes: PeopleAudience
comment: Audiences defined by a person's maximum age.

EUEnergyEfficiencyCategoryA
type: EUEnergyEfficiencyEnumeration
comment: Represents EU Energy Efficiency Class A as defined in EU energy labeling regulations.
isPartOf: pending.schema.org
source: https://github.com/schemaorg/schemaorg/issues/2670

DJMixAlbum
type: MusicAlbumProductionType
comment: DJMixAlbum.
contributor: MBZ

hasCredential
type: Property
comment: A credential awarded to the Person or Organization.
isPartOf: pending.schema.org
domainIncludes: Person
domainIncludes: Organization
rangeIncludes: EducationalOccupationalCredential
source: https://github.com/schemaorg/schemaorg/issues/2289

Abdomen
type: PhysicalExam
isPartOf: health-lifesci.schema.org
comment: Abdomen clinical examination.

members
type: Property
domainIncludes: Organization
domainIncludes: ProgramMembership
rangeIncludes: Person
rangeIncludes: Organization
supersededBy: member
comment: A member of this organization.

Mountain
type: Class
comment: A mountain, like Mount Whitney or Mount Everest.
subclass of: Landform

UsedCondition
type: OfferItemCondition
comment: Indicates that the item is used.

Fungus
type: InfectiousAgentClass
comment: Pathogenic fungus.
isPartOf: health-lifesci.schema.org

OnlineFull
type: GameServerStatus
comment: Game server status: OnlineFull. Server is online but unavailable. The maximum number of players has reached.

Embassy
type: Class
subclass of: GovernmentBuilding
comment: An embassy.

returnMethod
type: Property
rangeIncludes: ReturnMethodEnumeration
isPartOf: pending.schema.org
domainIncludes: MerchantReturnPolicySeasonalOverride
domainIncludes: MerchantReturnPolicy
comment: The type of return method offered, specified from an enumeration.
source: https://github.com/schemaorg/schemaorg/issues/2880

VideoGallery
type: Class
subclass of: MediaGallery
comment: Web page type: Video gallery page.

EnrollingByInvitation
type: MedicalStudyStatus
isPartOf: health-lifesci.schema.org
comment: Enrolling participants by invitation only.

EatAction
type: Class
comment: The act of swallowing solid objects.
subclass of: ConsumeAction

SpreadsheetDigitalDocument
type: Class
subclass of: DigitalDocument
comment: A spreadsheet file.

CardiovascularExam
type: PhysicalExam
isPartOf: health-lifesci.schema.org
comment: Cardiovascular system assessment with clinical examination.

variantCover
type: Property
rangeIncludes: Text
comment: A description of the variant cover for the issue, if the issue is a variant printing. For example, "Bryan Hitch Variant Cover" or "2nd Printing Variant".
isPartOf: bib.schema.org
domainIncludes: ComicIssue

Nonprofit501a
type: USNonprofitType
isPartOf: pending.schema.org
comment: Nonprofit501a: Non-profit type referring to Farmers’ Cooperative Associations.
source: https://github.com/schemaorg/schemaorg/issues/2543

RadioStation
type: Class
subclass of: LocalBusiness
comment: A radio station.

VinylFormat
type: MusicReleaseFormatType
comment: VinylFormat.
contributor: MBZ

activityFrequency
type: Property
rangeIncludes: Text
rangeIncludes: QuantitativeValue
comment: How often one should engage in the activity.
isPartOf: health-lifesci.schema.org
domainIncludes: ExercisePlan

valuePattern
type: Property
comment: Specifies a regular expression for testing literal values according to the HTML spec.
rangeIncludes: Text
domainIncludes: PropertyValueSpecification

estimatedSalary
type: Property
rangeIncludes: Number
rangeIncludes: MonetaryAmount
rangeIncludes: MonetaryAmountDistribution
domainIncludes: Occupation
domainIncludes: JobPosting
source: https://github.com/schemaorg/schemaorg/issues/1698
comment: An estimated salary for a job posting or occupation, based on a variety of variables including, but not limited to industry, job title, and location. Estimated salaries are often computed by outside organizations rather than the hiring organization, who may not have committed to the estimated value.

availability
type: Property
rangeIncludes: ItemAvailability
domainIncludes: Demand
domainIncludes: Offer
comment: The availability of this item—for example In stock, Out of stock, Pre-order, etc.

serviceUrl
type: Property
rangeIncludes: URL
comment: The website to access the service.
domainIncludes: ServiceChannel

artEdition
type: Property
domainIncludes: VisualArtwork
comment: The number of copies when multiple copies of a piece of artwork are produced - e.g. for a limited edition of 20 prints, 'artEdition' refers to the total number of copies (in this example "20").
rangeIncludes: Text
rangeIncludes: Integer

legalName
type: Property
rangeIncludes: Text
equivalent property: hasLegalName
equivalent property: organizationLegalName
sub property of: hasName
comment: The official name of the organization, e.g. the registered company name.
domainIncludes: Organization
contributor: GoodRelationsTerms

RegisterAction
type: Class
subclass of: InteractAction
comment: The act of registering to be a user of a service, product or web page.\n\nRelated actions:\n\n* JoinAction: Unlike JoinAction, RegisterAction implies you are registering to be a user of a service, *not* a group/team of people.\n* FollowAction: Unlike FollowAction, RegisterAction doesn't imply that the agent is expecting to poll for updates from the object.\n* SubscribeAction: Unlike SubscribeAction, RegisterAction doesn't imply that the agent is expecting updates from the object.

subReservation
type: Property
rangeIncludes: Reservation
comment: The individual reservations included in the package. Typically a repeated property.
domainIncludes: ReservationPackage

MobilePhoneStore
type: Class
subclass of: Store
comment: A store that sells mobile phones and related accessories.

programmingModel
type: Property
comment: Indicates whether API is managed or unmanaged.
rangeIncludes: Text
domainIncludes: APIReference

UnemploymentSupport
type: GovernmentBenefitsType
isPartOf: pending.schema.org
comment: UnemploymentSupport: this is a benefit for unemployment support.
source: https://github.com/schemaorg/schemaorg/issues/2534

Continent
type: Class
equivalent class: Continent
comment: One of the continents (for example, Europe or Africa).
subclass of: Landform

IncentiveQualifiedExpenseTypeGoodsOrServices
type: IncentiveQualifiedExpenseType
comment: This incentive can apply to either goods or services (or both).
isPartOf: pending.schema.org
source: https://github.com/schemaorg/schemaorg/issues/3572

WholesaleStore
type: Class
comment: A wholesale store.
subclass of: Store

HalalDiet
type: RestrictedDiet
comment: A diet conforming to Islamic dietary practices.

MedicalResearcher
type: MedicalAudienceType
comment: Medical researchers.
isPartOf: health-lifesci.schema.org

MobileWebPlatform
type: DigitalPlatformEnumeration
comment: Represents the broad notion of 'mobile' browsers as a Web Platform.
isPartOf: pending.schema.org
source: https://github.com/schemaorg/schemaorg/issues/3057

Pediatric
type: MedicalSpecialty
comment: A specific branch of medical science that specializes in the care of infants, children and adolescents.
isPartOf: health-lifesci.schema.org
subclass of: MedicalBusiness

GeneralContractor
type: Class
comment: A general contractor.
subclass of: HomeAndConstructionBusiness

relatedLink
type: Property
rangeIncludes: URL
comment: A link related to this web page, for example to other related web pages.
domainIncludes: WebPage

DepartmentStore
type: Class
subclass of: Store
comment: A department store.

WearableSizeSystemIT
type: WearableSizeSystemEnumeration
source: https://github.com/schemaorg/schemaorg/issues/2811
comment: Italian size system for wearables.
isPartOf: pending.schema.org

hasOccupation
type: Property
source: https://github.com/schemaorg/schemaorg/issues/1698
rangeIncludes: Occupation
comment: The Person's occupation. For past professions, use Role for expressing dates.
domainIncludes: Person

inPlaylist
type: Property
domainIncludes: MusicRecording
comment: The playlist to which this recording belongs.
rangeIncludes: MusicPlaylist

produces
type: Property
supersededBy: serviceOutput
domainIncludes: Service
rangeIncludes: Thing
comment: The tangible thing generated by the service, e.g. a passport, permit, etc.

serviceOutput
type: Property
rangeIncludes: Thing
comment: The tangible thing generated by the service, e.g. a passport, permit, etc.
domainIncludes: Service

requiredMinAge
type: Property
rangeIncludes: Integer
domainIncludes: PeopleAudience
comment: Audiences defined by a person's minimum age.

spatial
type: Property
equivalent property: spatial
rangeIncludes: Place
comment: The "spatial" property can be used in cases when more specific properties (e.g. locationCreated, spatialCoverage, contentLocation) are not known to be appropriate.
domainIncludes: CreativeWork

Flexibility
type: PhysicalActivityCategory
isPartOf: health-lifesci.schema.org
comment: Physical activity that is engaged in to improve joint and muscle flexibility.

Suspended
type: MedicalStudyStatus
isPartOf: health-lifesci.schema.org
comment: Suspended.

Geriatric
type: MedicalSpecialty
isPartOf: health-lifesci.schema.org
comment: A specific branch of medical science that is concerned with the diagnosis and treatment of diseases, debilities and provision of care to the aged.
subclass of: MedicalBusiness

AMRadioChannel
type: Class
comment: A radio channel that uses AM.
source: https://github.com/schemaorg/schemaorg/issues/1004
subclass of: RadioChannel

RadioEpisode
type: Class
subclass of: Episode
comment: A radio episode which can be part of a series or season.

Nonprofit501c17
type: USNonprofitType
isPartOf: pending.schema.org
comment: Nonprofit501c17: Non-profit type referring to Supplemental Unemployment Benefit Trusts.
source: https://github.com/schemaorg/schemaorg/issues/2543

PaymentAutomaticallyApplied
type: PaymentStatusType
comment: An automatic payment system is in place and will be used.

SocialEvent
type: Class
subclass of: Event
comment: Event type: Social event.

ComicSeries
type: Class
isPartOf: bib.schema.org
subclass of: Periodical
comment: A sequential publication of comic stories under a unifying title, for example "The Amazing Spider-Man" or "Groo the Wanderer".

RecyclingCenter
type: Class
subclass of: LocalBusiness
comment: A recycling center.

WearableMeasurementHips
type: WearableMeasurementTypeEnumeration
source: https://github.com/schemaorg/schemaorg/issues/2811
comment: Measurement of the hip section, for example of a skirt.
isPartOf: pending.schema.org

Hardcover
type: BookFormatType
comment: A durable, archival-quality book featuring a rigid protective shell made of heavy board wrapped in cloth or paper, designed to withstand heavy use and preservation on a shelf.

HairSalon
type: Class
subclass of: HealthAndBeautyBusiness
comment: A hair salon.

providerMobility
type: Property
rangeIncludes: Text
domainIncludes: Service
comment: Indicates the mobility of a provided service (e.g. 'static', 'dynamic').

Statement
type: Class
subclass of: CreativeWork
isPartOf: pending.schema.org
source: https://github.com/schemaorg/schemaorg/issues/2912
comment: A statement about something, for example a fun or interesting fact. If known, the main entity this statement is about can be indicated using mainEntity. For more formal claims (e.g. in Fact Checking), consider using Claim instead. Use the text property to capture the text of the statement.

maximumAttendeeCapacity
type: Property
rangeIncludes: Integer
domainIncludes: Event
domainIncludes: Place
comment: The total number of individuals that may attend an event or venue.
sub property of: hasUpperBound

howPerformed
type: Property
rangeIncludes: Text
comment: How the procedure is performed.
domainIncludes: MedicalProcedure
isPartOf: health-lifesci.schema.org

ZoneBoardingPolicy
type: BoardingPolicyType
comment: The airline boards by zones of the plane.

WearableSizeSystemFR
type: WearableSizeSystemEnumeration
isPartOf: pending.schema.org
source: https://github.com/schemaorg/schemaorg/issues/2811
comment: French size system for wearables.

lesserOrEqual
type: Property
domainIncludes: QualitativeValue
rangeIncludes: QualitativeValue
comment: This ordering relation for qualitative values indicates that the subject is lesser than or equal to the object.
contributor: GoodRelationsTerms

acceptedOffer
type: Property
domainIncludes: Order
comment: The offer(s) -- e.g., product, quantity and price combinations -- included in the order.
rangeIncludes: Offer

EventCancelled
type: EventStatusType
comment: The event has been cancelled. If the event has multiple startDate values, all are assumed to be cancelled. Either startDate or previousStartDate may be used to specify the event's cancelled date(s).

EPRelease
type: MusicAlbumReleaseType
comment: EPRelease.
contributor: MBZ

SiteNavigationElement
type: Class
comment: A navigation element of the page.
subclass of: WebPageElement

performers
type: Property
domainIncludes: Event
supersededBy: performer
comment: The main performer or performers of the event—for example, a presenter, musician, or actor.
rangeIncludes: Person
rangeIncludes: Organization

performer
type: Property
domainIncludes: Event
comment: A performer at the event—for example, a presenter, musician, musical group or actor.
rangeIncludes: Person
rangeIncludes: Organization

numberOfPreviousOwners
type: Property
contributor: Automotive Ontology Working Group
comment: The number of owners of the vehicle, including the current one.\n\nTypical unit code(s): C62.
rangeIncludes: QuantitativeValue
rangeIncludes: Number
domainIncludes: Vehicle

MovingCompany
type: Class
subclass of: HomeAndConstructionBusiness
comment: A moving company.

EUEnergyEfficiencyCategoryE
type: EUEnergyEfficiencyEnumeration
isPartOf: pending.schema.org
source: https://github.com/schemaorg/schemaorg/issues/2670
comment: Represents EU Energy Efficiency Class E as defined in EU energy labeling regulations.

InStock
type: ItemAvailability
comment: Indicates that the item is in stock.

Restaurant
type: Class
comment: A restaurant.
subclass of: FoodEstablishment

modifiedTime
type: Property
comment: The date and time the reservation was modified.
rangeIncludes: DateTime
domainIncludes: Reservation

DiscoverAction
type: Class
subclass of: FindAction
comment: The act of discovering/finding an object.

HVACBusiness
type: Class
subclass of: HomeAndConstructionBusiness
comment: A business that provides Heating, Ventilation and Air Conditioning services.

BusinessSupport
type: GovernmentBenefitsType
comment: BusinessSupport: this is a benefit for supporting businesses.
isPartOf: pending.schema.org
source: https://github.com/schemaorg/schemaorg/issues/2534

ReturnLabelInBox
type: ReturnLabelSourceEnumeration
isPartOf: pending.schema.org
comment: Specifies that a return label will be provided by the seller in the shipping box.
source: https://github.com/schemaorg/schemaorg/issues/2880

Physiotherapy
type: MedicalSpecialty
isPartOf: health-lifesci.schema.org
comment: The practice of treatment of disease, injury, or deformity by physical methods such as massage, heat treatment, and exercise rather than by drugs or surgery.
subclass of: MedicalBusiness

bookFormat
type: Property
comment: The format of the book.
domainIncludes: Book
rangeIncludes: BookFormatType

Pamphlet
type: BookFormatType
comment: A small, unbound or stapled booklet consisting of few pages with a flexible paper cover, designed for the economical distribution of focused information on a single subject.

CertificationInactive
type: CertificationStatusEnumeration
isPartOf: pending.schema.org
source: https://github.com/schemaorg/schemaorg/issues/3230
comment: Specifies that a certification is inactive (no longer in effect).

HinduDiet
type: RestrictedDiet
comment: A diet conforming to Hindu dietary practices, in particular, beef-free.

dateSent
type: Property
comment: The date/time at which the message was sent.
domainIncludes: Message
rangeIncludes: DateTime

ownedFrom
type: Property
rangeIncludes: DateTime
domainIncludes: OwnershipInfo
contributor: GoodRelationsTerms
comment: The date and time of obtaining the product.

legalAddress
type: Property
domainIncludes: Organization
equivalent property: hasRegisteredAddress
sub property of: hasAddress
rangeIncludes: PostalAddress
comment: The legal address of an organization which acts as the officially registered address used for legal and tax purposes. The legal address can be different from the place of operations of a business and other addresses can be part of an organization.

Friday
type: DayOfWeek
comment: The day of the week between Thursday and Saturday.

timeRequired
type: Property
domainIncludes: CreativeWork
comment: Approximate or typical time it usually takes to work with or through the content of this work for the typical or target audience.
rangeIncludes: Duration

CharitableIncorporatedOrganization
type: UKNonprofitType
isPartOf: pending.schema.org
comment: CharitableIncorporatedOrganization: Non-profit type referring to a Charitable Incorporated Organization (UK).
source: https://github.com/schemaorg/schemaorg/issues/2543

greater
type: Property
rangeIncludes: QualitativeValue
domainIncludes: QualitativeValue
comment: This ordering relation for qualitative values indicates that the subject is greater than the object.
contributor: GoodRelationsTerms

TelevisionChannel
type: Class
subclass of: BroadcastChannel
comment: A unique instance of a television BroadcastService on a CableOrSatelliteService lineup.

CompletedActionStatus
type: ActionStatusType
comment: An action that has already taken place.

broadcastChannelId
type: Property
rangeIncludes: Text
domainIncludes: BroadcastChannel
comment: The unique address by which the BroadcastService can be identified in a provider lineup. In US, this is typically a number.

Conversation
type: Class
subclass of: CreativeWork
comment: One or more messages between organizations or people on a particular topic. Individual messages can be linked to the conversation with isPartOf or hasPart properties.

addOn
type: Property
comment: An additional offer that can only be obtained in combination with the first base offer (e.g. supplements and extensions that are available for a surcharge).
rangeIncludes: Offer
domainIncludes: Offer
contributor: GoodRelationsTerms

OfflinePermanently
type: GameServerStatus
comment: Game server status: OfflinePermanently. Server is offline and not available.

issuedThrough
type: Property
domainIncludes: Permit
rangeIncludes: Service
comment: The service through which the permit was granted.

PaymentComplete
type: PaymentStatusType
comment: The payment has been received and processed.

Nonprofit501c13
type: USNonprofitType
isPartOf: pending.schema.org
source: https://github.com/schemaorg/schemaorg/issues/2543
comment: Nonprofit501c13: Non-profit type referring to Cemetery Companies.

ReadAction
type: Class
subclass of: ConsumeAction
comment: The act of consuming written content.

syllabusSections
type: Property
domainIncludes: Course
isPartOf: pending.schema.org
rangeIncludes: Syllabus
source: https://github.com/schemaorg/schemaorg/issues/3281
comment: Indicates (typically several) Syllabus entities that lay out what each section of the overall course will cover.

BasicIncome
type: GovernmentBenefitsType
isPartOf: pending.schema.org
source: https://github.com/schemaorg/schemaorg/issues/2534
comment: BasicIncome: this is a benefit for basic income.

Painting
type: Class
subclass of: CreativeWork
comment: A painting.

Dermatologic
type: MedicalSpecialty
comment: Something relating to or practicing dermatology.
supersededBy: Dermatology
isPartOf: health-lifesci.schema.org

Dermatology
type: MedicalSpecialty
isPartOf: health-lifesci.schema.org
subclass of: MedicalBusiness
comment: A specific branch of medical science that pertains to diagnosis and treatment of disorders of skin.

Courthouse
type: Class
comment: A courthouse.
subclass of: GovernmentBuilding

GlutenFreeDiet
type: RestrictedDiet
comment: A diet exclusive of gluten.

ActiveNotRecruiting
type: MedicalStudyStatus
isPartOf: health-lifesci.schema.org
comment: Active, but not recruiting new participants.

ImageGallery
type: Class
subclass of: MediaGallery
comment: Web page type: Image gallery page.

deathPlace
type: Property
rangeIncludes: Place
domainIncludes: Person
comment: The place where the person died.

MixtapeAlbum
type: MusicAlbumProductionType
contributor: MBZ
comment: MixtapeAlbum.

EUEnergyEfficiencyCategoryG
type: EUEnergyEfficiencyEnumeration
isPartOf: pending.schema.org
comment: Represents EU Energy Efficiency Class G as defined in EU energy labeling regulations.
source: https://github.com/schemaorg/schemaorg/issues/2670

DownloadAction
type: Class
subclass of: TransferAction
comment: The act of downloading an object.

releasedEvent
type: Property
rangeIncludes: PublicationEvent
comment: The place and time the release was issued, expressed as a PublicationEvent.
domainIncludes: CreativeWork

codeRepository
type: Property
domainIncludes: SoftwareSourceCode
rangeIncludes: URL
comment: Link to the repository where the un-compiled, human readable code and related code is located (SVN, GitHub, CodePlex).

BookmarkAction
type: Class
comment: An agent bookmarks/flags/labels/tags/marks an object.
subclass of: OrganizeAction

albumReleaseType
type: Property
contributor: MBZ
domainIncludes: MusicAlbum
rangeIncludes: MusicAlbumReleaseType
comment: The kind of release which this album is: single, EP or album.

ByBankTransferInAdvance
type: PaymentMethodType
comment: Payment in advance by bank transfer, equivalent to http://purl.org/goodrelations/v1#ByBankTransferInAdvance.

circle
type: Property
rangeIncludes: Text
comment: A circle is the circular region of a specified radius centered at a specified latitude and longitude. A circle is expressed as a pair followed by a radius in meters.
domainIncludes: GeoShape

PregnancyHealthAspect
type: HealthAspectEnumeration
source: https://github.com/schemaorg/schemaorg/issues/2799
isPartOf: pending.schema.org
comment: Content discussing pregnancy-related aspects of a health topic.

Researcher
type: Class
comment: Researchers.
subclass of: Audience

multipleValues
type: Property
comment: Whether multiple values are allowed for the property. Default is false.
domainIncludes: PropertyValueSpecification
rangeIncludes: Boolean

ReturnLabelCustomerResponsibility
type: ReturnLabelSourceEnumeration
isPartOf: pending.schema.org
comment: Indicated that creating a return label is the responsibility of the customer.
source: https://github.com/schemaorg/schemaorg/issues/2880

Bakery
type: Class
subclass of: FoodEstablishment
comment: A bakery.

Reserved
type: ItemAvailability
comment: Indicates that the item is reserved and therefore not available.

DeactivateAction
type: Class
subclass of: ControlAction
comment: The act of stopping or deactivating a device or application (e.g. stopping a timer or turning off a flashlight).

RiverBodyOfWater
type: Class
subclass of: BodyOfWater
comment: A river (for example, the broad majestic Shannon).

Neck
type: PhysicalExam
isPartOf: health-lifesci.schema.org
comment: Neck assessment with clinical examination.

Festival
type: Class
subclass of: Event
comment: Event type: Festival.

Museum
type: Class
comment: A museum.
subclass of: CivicStructure

DirectDebit
type: PaymentMethodType
comment: Payment in advance by direct debit from the bank, equivalent to http://purl.org/goodrelations/v1#DirectDebit.

WearableSizeGroupGirls
type: WearableSizeGroupEnumeration
source: https://github.com/schemaorg/schemaorg/issues/2811
comment: Size group "Girls" for wearables.
isPartOf: pending.schema.org

SideEffectsHealthAspect
type: HealthAspectEnumeration
isPartOf: pending.schema.org
comment: Side effects that can be observed from the usage of the topic.
source: https://github.com/schemaorg/schemaorg/issues/2374

Anesthesia
type: MedicalSpecialty
comment: A specific branch of medical science that pertains to study of anesthetics and their application.
isPartOf: health-lifesci.schema.org

False
type: Boolean
comment: The boolean value false.

SportsClub
type: Class
comment: A sports club.
subclass of: SportsActivityLocation

LowSaltDiet
type: RestrictedDiet
comment: A diet focused on reduced sodium intake.

MovieTheater
type: Class
subclass of: CivicStructure
subclass of: EntertainmentBusiness
comment: A movie theater.

MedicalIntangible
type: Class
subclass of: MedicalEntity
comment: A utility class that serves as the umbrella for a number of 'intangible' things in the medical space.
isPartOf: health-lifesci.schema.org

Vehicle
type: Class
comment: A vehicle is a device that is designed or used to transport people or cargo over land, water, air, or through space.
subclass of: Product

MedicalBusiness
type: Class
isPartOf: health-lifesci.schema.org
subclass of: LocalBusiness
comment: A particular physical or virtual business of an organization for medical purposes. Examples of MedicalBusiness include different businesses run by health professionals.

BusOrCoach
type: Class
isPartOf: auto.schema.org
comment: A bus (also omnibus or autobus) is a road vehicle designed to carry passengers. Coaches are luxury buses, usually in service for long distance travel.
subclass of: Vehicle
contributor: Automotive Ontology Working Group

MaximumDoseSchedule
type: Class
subclass of: DoseSchedule
isPartOf: health-lifesci.schema.org
comment: The maximum dosing schedule considered safe for a drug or supplement as recommended by an authority or by the drug/supplement's manufacturer. Capture the recommending authority in the recognizingAuthority property of MedicalEntity.

Duration
type: Class
comment: Quantity: Duration (use [ISO 8601 duration format](http://en.wikipedia.org/wiki/ISO_8601)).
subclass of: Quantity
equivalent class: Duration

Boolean
type: DataType
comment: Boolean: True or False.
type: Class

BuyAction
type: Class
subclass of: TradeAction
comment: The act of giving money to a seller in exchange for goods or services rendered. An agent buys an object, product, or service from a seller for a price. Reciprocal of SellAction.

InstantaneousEvent
type: Class
equivalent class: InstantaneousEvent
isPartOf: pending.schema.org
subclass of: StructuredValue
comment: An event with no duration, like for instance a computer log entry.
source: https://github.com/schemaorg/schemaorg/issues/4527

ItemList
type: Class
subclass of: Intangible
comment: A list of items of any sort—for example, Top 10 Movies About Weathermen, or Top 100 Party Songs. Not to be confused with HTML lists, which are often used only for formatting.

Legislation
type: Class
source: https://github.com/schemaorg/schemaorg/issues/1156
source: eli
contributor: ELI
subclass of: CreativeWork
isPartOf: pending.schema.org
comment: A legal document such as an act, decree, bill, etc. (enforceable or not) or a component of a legal act (like an article).

Quantity
type: Class
comment: Quantities such as distance, time, mass, weight, etc. Particular instances of say Mass are entities like '3 kg' or '4 milligrams'.
subclass of: Intangible

ReservationPackage
type: Class
comment: A group of multiple reservations with common values for all sub-reservations.
subclass of: Reservation

IncentiveStatus
type: Class
subclass of: Enumeration
isPartOf: pending.schema.org
source: https://github.com/schemaorg/schemaorg/issues/3572
comment: Enumerates a status for an incentive, such as whether it is active.

AnatomicalSystem
type: Class
subclass of: MedicalEntity
comment: An anatomical system is a group of anatomical structures that work together to perform a certain task. Anatomical systems, such as organ systems, are one organizing principle of anatomy, and can include circulatory, digestive, endocrine, integumentary, immune, lymphatic, muscular, nervous, reproductive, respiratory, skeletal, urinary, vestibular, and other systems.
isPartOf: health-lifesci.schema.org

DrugLegalStatus
type: Class
subclass of: MedicalIntangible
comment: The legal availability status of a medical drug.
isPartOf: health-lifesci.schema.org

PostalAddress
type: Class
equivalent class: PostalAddress
equivalent class: Address
equivalent class: TradeAddress
subclass of: ContactPoint
comment: The mailing address.

isVariantOf
type: Property
domainIncludes: Product
domainIncludes: ProductModel
rangeIncludes: ProductModel
rangeIncludes: ProductGroup
comment: Indicates the kind of product that this is a variant of. In the case of ProductModel, this is a pointer (from a ProductModel) to a base product from which this product is a variant. It is safe to infer that the variant inherits all product features from the base model, unless defined locally. This is not transitive. In the case of a ProductGroup, the group description also serves as a template, representing a set of Products that vary on explicitly defined, specific dimensions only (so it defines both a set of variants, as well as which values distinguish amongst those variants). When used with ProductGroup, this property can apply to any Product included in the group.
sub property of: exemplifies
sub property of: broader
contributor: GoodRelationsTerms
inverseOf: hasVariant

hasVariant
type: Property
isPartOf: pending.schema.org
rangeIncludes: Product
comment: Indicates a Product that is a member of this ProductGroup (or ProductModel).
source: https://github.com/schemaorg/schemaorg/issues/1797
domainIncludes: ProductGroup
inverseOf: isVariantOf

funding
type: Property
isPartOf: pending.schema.org
domainIncludes: MedicalEntity
domainIncludes: BioChemEntity
domainIncludes: CreativeWork
domainIncludes: Organization
domainIncludes: Person
domainIncludes: Product
domainIncludes: Event
inverseOf: fundedItem
rangeIncludes: Grant
comment: A Grant that directly or indirectly provide funding or sponsorship for this item. See also ownershipFundingInfo.
contributor: TP
source: https://github.com/schemaorg/schemaorg/issues/383

fundedItem
type: Property
isPartOf: pending.schema.org
source: https://github.com/schemaorg/schemaorg/issues/1950
source: https://github.com/schemaorg/schemaorg/issues/383
rangeIncludes: Product
rangeIncludes: Event
rangeIncludes: CreativeWork
rangeIncludes: MedicalEntity
rangeIncludes: BioChemEntity
rangeIncludes: Person
rangeIncludes: Organization
comment: Indicates something directly or indirectly funded or sponsored through a Grant. See also ownershipFundingInfo.
inverseOf: funding
domainIncludes: Grant
contributor: TP

DietarySupplement
type: Class
subclass of: Substance
subclass of: Product
isPartOf: health-lifesci.schema.org
comment: A product taken by mouth that contains a dietary ingredient intended to supplement the diet. Dietary ingredients may include vitamins, minerals, herbs or other botanicals, amino acids, and substances such as enzymes, organ tissues, glandulars and metabolites.

BrainStructure
type: Class
comment: Any anatomical structure which pertains to the soft nervous tissue functioning as the coordinating center of sensation and intellectual and nervous activity.
subclass of: AnatomicalStructure
isPartOf: health-lifesci.schema.org

MediaSubscription
type: Class
subclass of: Intangible
source: https://github.com/schemaorg/schemaorg/issues/1741
comment: A subscription which allows a user to access media including audio, video, books, etc.

Demand
type: Class
subclass of: Intangible
contributor: good-relations-and-schema-org
comment: A demand entity represents the public, not necessarily binding, not necessarily exclusive, announcement by an organization or person to seek a certain type of goods or services. For describing demand using this type, the very same properties used for Offer apply.
equivalent class: RequestForQuotation

GeoCoordinates
type: Class
comment: The geographic coordinates of a place or event.
equivalent class: GeographicCoordinate
equivalent class: GeographicalCoordinate
subclass of: StructuredValue

EducationalOccupationalProgram
type: Class
source: https://github.com/schemaorg/schemaorg/issues/2289
subclass of: Intangible
isPartOf: pending.schema.org
comment: A program offered by an institution which determines the learning progress to achieve an outcome, usually a credential like a degree or certificate. This would define a discrete set of opportunities (e.g., job, courses) that together constitute a program with a clear start, end, set of requirements, and transition to a new occupational opportunity (e.g., a job), or sometimes a higher educational opportunity (e.g., an advanced degree).

DataFeed
type: Class
subclass of: Dataset
comment: A single feed providing structured information about one or more entities or topics.

LendAction
type: Class
comment: The act of providing an object under an agreement that it will be returned at a later date. Reciprocal of BorrowAction.\n\nRelated actions:\n\n* BorrowAction: Reciprocal of LendAction.
subclass of: TransferAction

Photograph
type: Class
comment: A photograph.
subclass of: CreativeWork

HealthPlanFormulary
type: Class
source: https://github.com/schemaorg/schemaorg/issues/1062
subclass of: Intangible
comment: For a given health insurance plan, the specification for costs and coverage of prescription drugs.
isPartOf: pending.schema.org

holdingArchive
type: Property
rangeIncludes: ArchiveOrganization
inverseOf: archiveHeld
comment: ArchiveOrganization that holds, keeps or maintains the ArchiveComponent.
source: https://github.com/schemaorg/schemaorg/issues/1758
isPartOf: pending.schema.org
domainIncludes: ArchiveComponent

archiveHeld
type: Property
comment: Collection, [fonds](https://en.wikipedia.org/wiki/Fonds), or item held, kept or maintained by an ArchiveOrganization.
rangeIncludes: ArchiveComponent
inverseOf: holdingArchive
isPartOf: pending.schema.org
source: https://github.com/schemaorg/schemaorg/issues/1758
domainIncludes: ArchiveOrganization

Comment
type: Class
comment: A comment on an item - for example, a comment on a blog post. The comment's content is expressed via the text property, and its topic via about, properties shared with all CreativeWorks.
subclass of: CreativeWork

MusicAlbumProductionType
type: Class
subclass of: Enumeration
contributor: MBZ
comment: Classification of the album by its type of content: soundtrack, live album, studio album, etc.

ConstraintNode
type: Class
isPartOf: pending.schema.org
comment: The ConstraintNode type is provided to support usecases in which a node in a structured data graph is described with properties which appear to describe a single entity, but are being used in a situation where they serve a more abstract purpose. A ConstraintNode can be described using constraintProperty and numConstraints. These constraint properties can serve a variety of purposes, and their values may sometimes be understood to indicate sets of possible values rather than single, exact and specific values.
source: https://github.com/schemaorg/schemaorg/issues/2564
subclass of: Intangible

GovernmentBuilding
type: Class
subclass of: CivicStructure
comment: A government building.

OrderItem
type: Class
equivalent class: LineTradeAgreement
subclass of: StructuredValue
comment: An order item is a line of an order. It includes the quantity and shipping details of a bought offer.

GameAvailabilityEnumeration
type: Class
source: https://github.com/schemaorg/schemaorg/issues/3058
subclass of: Enumeration
comment: For a VideoGame, such as used with a PlayGameAction, an enumeration of the kind of game availability offered.
isPartOf: pending.schema.org

VirtualLocation
type: Class
comment: An online or virtual location for attending events. For example, one may attend an online seminar or educational event. While a virtual location may be used as the location of an event, virtual locations should not be confused with physical locations in the real world.
isPartOf: pending.schema.org
subclass of: Intangible
source: https://github.com/schemaorg/schemaorg/issues/1842

Resort
type: Class
subclass of: LodgingBusiness
comment: A resort is a place used for relaxation or recreation, attracting visitors for holidays or vacations. Resorts are places, towns or sometimes commercial establishments operated by a single company (source: Wikipedia, the free encyclopedia, see http://en.wikipedia.org/wiki/Resort). See also the dedicated document on the use of schema.org for marking up hotels and other forms of accommodations.
contributor: STI Accommodation Ontology

CreateAction
type: Class
comment: The act of deliberately creating/producing/generating/building a result out of the agent.
subclass of: Action

SoftwareApplication
type: Class
subclass of: CreativeWork
comment: A software application.

HowToTool
type: Class
comment: A tool used (but not consumed) when performing instructions for how to achieve a result.
subclass of: HowToItem

DefinedTermSet
type: Class
comment: A set of defined terms, for example a set of categories or a classification scheme, a glossary, dictionary or enumeration. Use the about property to specify what the term set is about.
source: https://github.com/schemaorg/schemaorg/issues/894
isPartOf: pending.schema.org
subclass of: CreativeWork

RadioChannel
type: Class
subclass of: BroadcastChannel
comment: A unique instance of a radio BroadcastService on a CableOrSatelliteService lineup.

alumniOf
type: Property
domainIncludes: Person
rangeIncludes: EducationalOrganization
rangeIncludes: Organization
inverseOf: alumni
comment: An organization that the person is an alumni of.

alumni
type: Property
domainIncludes: Organization
domainIncludes: EducationalOrganization
rangeIncludes: Person
comment: Alumni of an organization.
inverseOf: alumniOf

ApartmentComplex
type: Class
comment: Residence type: Apartment complex.
subclass of: Residence

EducationalOccupationalCredential
type: Class
isPartOf: pending.schema.org
source: https://github.com/schemaorg/schemaorg/issues/1779
comment: An educational or occupational credential. A diploma, academic degree, certification, qualification, badge, etc., that may be awarded to a person or other entity that meets the requirements defined by the credentialer.
subclass of: CreativeWork

BedType
type: Class
contributor: STI Accommodation Ontology
comment: A type of bed. This is used for indicating the bed or beds available in an accommodation.
subclass of: QualitativeValue
source: https://github.com/schemaorg/schemaorg/issues/1262

IncentiveType
type: Class
subclass of: Enumeration
isPartOf: pending.schema.org
source: https://github.com/schemaorg/schemaorg/issues/3572
comment: Enumerates common financial incentives for products, including tax credits, tax deductions, rebates and subsidies, etc.

MerchantReturnEnumeration
type: Class
subclass of: Enumeration
isPartOf: pending.schema.org
source: https://github.com/schemaorg/schemaorg/issues/2288
comment: Enumerates several kinds of product return policies.

HealthInsurancePlan
type: Class
isPartOf: pending.schema.org
comment: A US-style health insurance plan, including PPOs, EPOs, and HMOs.
source: https://github.com/schemaorg/schemaorg/issues/1062
subclass of: Intangible

DefinedRegion
type: Class
subclass of: Place
subclass of: StructuredValue
comment: A DefinedRegion is a geographic area defined by potentially arbitrary (rather than political, administrative or natural geographical) criteria. Properties are provided for defining a region by reference to sets of postal codes. Examples: a delivery destination when shopping. Region where regional pricing is configured. Requirement 1: Country: US States: "NY", "CA" Requirement 2: Country: US PostalCode Set: { [94000-94585], [97000, 97999], [13000, 13599]} { [12345, 12345], [78945, 78945], } Region = state, canton, prefecture, autonomous community...
source: https://github.com/schemaorg/schemaorg/issues/2506

CDCPMDRecord
type: Class
source: https://github.com/schemaorg/schemaorg/issues/2521
comment: A CDCPMDRecord is a data structure representing a record in a CDC tabular data format used for hospital data reporting. See [documentation](/docs/cdc-covid.html) for details, and the linked CDC materials for authoritative definitions used as the source here.
isPartOf: pending.schema.org
subclass of: StructuredValue

ExchangeRateSpecification
type: Class
contributor: FIBO
isPartOf: pending.schema.org
subclass of: StructuredValue
source: https://github.com/schemaorg/schemaorg/issues/1253
comment: A structured value representing exchange rate.

Property
type: Class
comment: A property, used to indicate attributes and relationships of some Thing; equivalent to rdf:Property.
subclass of: Intangible
equivalent class: Property
isPartOf: meta.schema.org

WorkBasedProgram
type: Class
source: https://github.com/schemaorg/schemaorg/issues/2289
isPartOf: pending.schema.org
subclass of: EducationalOccupationalProgram
comment: A program with both an educational and employment component. Typically based at a workplace and structured around work-based learning, with the aim of instilling competencies related to an occupation. WorkBasedProgram is used to distinguish programs such as apprenticeships from school, college or other classroom based educational programs.

Quotation
type: Class
subclass of: CreativeWork
source: https://github.com/schemaorg/schemaorg/issues/271
isPartOf: pending.schema.org
comment: A quotation. Often but not necessarily from some written work, attributable to a real world author and - if associated with a fictional character - to any fictional Person. Use isBasedOn to link to source/origin. The recordedIn property can be used to reference a Quotation from an Event.

Trip
type: Class
contributor: Tourism
comment: A trip or journey. An itinerary of visits to one or more places.
subclass of: Intangible

TouristTrip
type: Class
comment: A tourist trip. A created itinerary of visits to one or more places of interest (TouristAttraction/TouristDestination) often linked by a similar theme, geographic area, or interest to a particular touristType. The [UNWTO](http://www2.unwto.org/) defines tourism trip as the Trip taken by visitors. (See examples below.)
isPartOf: pending.schema.org
contributor: IIT-CNR.it
contributor: Tourism
subclass of: Trip
source: https://github.com/schemaorg/schemaorg/issues/1810

SingleFamilyResidence
type: Class
subclass of: House
comment: Residence type: Single-family home.

Review
type: Class
subclass of: CreativeWork
comment: A review of an item - for example, of a restaurant, movie, or store.

DateTime
type: Class
comment: A combination of date and time of day in the form [-]CCYY-MM-DDThh:mm:ss[Z|(+|-)hh:mm] (see Chapter 5.4 of ISO 8601).
type: DataType
equivalent class: DateTime

WearableSizeGroupEnumeration
type: Class
isPartOf: pending.schema.org
comment: Enumerates common size groups (also known as "size types") for wearable products.
subclass of: SizeGroupEnumeration
source: https://github.com/schemaorg/schemaorg/issues/2811

Vein
type: Class
subclass of: Vessel
isPartOf: health-lifesci.schema.org
comment: A type of blood vessel that specifically carries blood to the heart.

OccupationalExperienceRequirements
type: Class
source: https://github.com/schemaorg/schemaorg/issues/2681
subclass of: Intangible
comment: Indicates employment-related experience requirements, e.g. monthsOfExperience.
isPartOf: pending.schema.org

workTranslation
type: Property
comment: A work that is a translation of the content of this work. E.g. 西遊記 has an English workTranslation “Journey to the West”, a German workTranslation “Monkeys Pilgerfahrt” and a Vietnamese translation Tây du ký bình khảo.
isPartOf: bib.schema.org
inverseOf: translationOfWork
domainIncludes: CreativeWork
rangeIncludes: CreativeWork

translationOfWork
type: Property
domainIncludes: CreativeWork
rangeIncludes: CreativeWork
isPartOf: bib.schema.org
inverseOf: workTranslation
comment: The work that this work has been translated from. E.g. 物种起源 is a translationOf “On the Origin of Species”.

AchieveAction
type: Class
comment: The act of accomplishing something via previous efforts. It is an instantaneous action rather than an ongoing process.
subclass of: Action

GeospatialGeometry
type: Class
isPartOf: pending.schema.org
source: https://github.com/schemaorg/schemaorg/issues/1375
subclass of: Intangible
comment: (Eventually to be defined as) a supertype of GeoShape designed to accommodate definitions from Geo-Spatial best practices.

EntertainmentBusiness
type: Class
subclass of: LocalBusiness
comment: A business providing entertainment.

HowToSection
type: Class
subclass of: CreativeWork
subclass of: ItemList
subclass of: ListItem
comment: A sub-grouping of steps in the instructions for how to achieve a result (e.g. steps for making a pie crust within a pie recipe).

Syllabus
type: Class
comment: A syllabus that describes the material covered in a course, often with several such sections per Course so that a distinct timeRequired can be provided for that section of the Course.
subclass of: LearningResource
isPartOf: pending.schema.org
source: https://github.com/schemaorg/schemaorg/issues/3281

MusicAlbumReleaseType
type: Class
subclass of: Enumeration
comment: The kind of release which this album is: single, EP or album.
contributor: MBZ

containsSeason
type: Property
rangeIncludes: CreativeWorkSeason
domainIncludes: VideoGameSeries
domainIncludes: TVSeries
domainIncludes: RadioSeries
sub property of: hasPart
comment: A season that is part of the media series.

House
type: Class
contributor: STI Accommodation Ontology
comment: A house is a building or structure that has the ability to be occupied for habitation by humans or other creatures (source: Wikipedia, the free encyclopedia, see http://en.wikipedia.org/wiki/House).
subclass of: Accommodation

MedicineSystem
type: Class
comment: Systems of medical practice.
isPartOf: health-lifesci.schema.org
subclass of: MedicalEnumeration

MedicalProcedure
type: Class
isPartOf: health-lifesci.schema.org
equivalent class: http://purl.bioontology.org/ontology/SNOMEDCT/50731006
subclass of: MedicalEntity
comment: A process of care used in either a diagnostic, therapeutic, preventive or palliative capacity that relies on invasive (surgical), non-invasive, or other techniques.

MathSolver
type: Class
isPartOf: pending.schema.org
comment: A math solver which is capable of solving a subset of mathematical problems.
source: https://github.com/schemaorg/schemaorg/issues/2740
subclass of: CreativeWork

Observation
type: Class
subclass of: Intangible
subclass of: QuantitativeValue
isPartOf: pending.schema.org
source: https://github.com/schemaorg/schemaorg/issues/2291
comment: Instances of the class Observation are used to specify observations about an entity at a particular time. The principal properties of an Observation are observationAbout, measuredProperty, statType, [[value] and observationDate and measuredProperty. Some but not all Observations represent a QuantitativeValue. Quantitative observations can be about a StatisticalVariable, which is an abstract specification about which we can make observations that are grounded at a particular location and time. Observations can also encode a subset of simple RDF-like statements (its observationAbout, a StatisticalVariable, defining the measuredPoperty; its observationAbout property indicating the entity the statement is about, and value ) In the context of a quantitative knowledge graph, typical properties could include measuredProperty, observationAbout, observationDate, value, unitCode, unitText, measurementMethod.

hasTiers
type: Property
comment: The tiers of a member program.
inverseOf: isTierOf
rangeIncludes: MemberProgramTier
source: https://github.com/schemaorg/schemaorg/issues/3563
domainIncludes: MemberProgram

isTierOf
type: Property
domainIncludes: MemberProgramTier
inverseOf: hasTiers
rangeIncludes: MemberProgram
source: https://github.com/schemaorg/schemaorg/issues/3563
comment: The member program this tier is a part of.

AssessAction
type: Class
comment: The act of forming one's opinion, reaction or sentiment.
subclass of: Action

RepaymentSpecification
type: Class
comment: A structured value representing repayment.
contributor: FIBO
isPartOf: pending.schema.org
subclass of: StructuredValue
source: https://github.com/schemaorg/schemaorg/issues/1253

FoodEstablishment
type: Class
subclass of: LocalBusiness
comment: A food-related business.

isEncodedByBioChemEntity
type: Property
source: Gene
inverseOf: encodesBioChemEntity
domainIncludes: BioChemEntity
isPartOf: pending.schema.org
rangeIncludes: Gene
comment: Another BioChemEntity encoding by this one.

encodesBioChemEntity
type: Property
rangeIncludes: BioChemEntity
comment: Another BioChemEntity encoded by this one.
source: Gene
inverseOf: isEncodedByBioChemEntity
isPartOf: pending.schema.org
domainIncludes: Gene

Apartment
type: Class
contributor: STI Accommodation Ontology
subclass of: Accommodation
comment: An apartment (in American English) or flat (in British English) is a self-contained housing unit (a type of residential real estate) that occupies only part of a building (source: Wikipedia, the free encyclopedia, see http://en.wikipedia.org/wiki/Apartment).

ConsumeAction
type: Class
subclass of: Action
comment: The act of ingesting information/resources/food.

parentTaxon
type: Property
inverseOf: childTaxon
source: Taxon
rangeIncludes: Taxon
rangeIncludes: URL
rangeIncludes: Text
isPartOf: pending.schema.org
domainIncludes: Taxon
comment: Closest parent taxon of the taxon in question.

childTaxon
type: Property
rangeIncludes: Taxon
rangeIncludes: URL
rangeIncludes: Text
domainIncludes: Taxon
comment: Closest child taxa of the taxon in question.
source: Taxon
inverseOf: parentTaxon
isPartOf: pending.schema.org

LeaveAction
type: Class
comment: An agent leaves an event / group with participants/friends at a location.\n\nRelated actions:\n\n* JoinAction: The antonym of LeaveAction.\n* UnRegisterAction: Unlike UnRegisterAction, LeaveAction implies leaving a group/team of people rather than a service.
subclass of: InteractAction

LegislationObject
type: Class
source: https://github.com/schemaorg/schemaorg/issues/1156
source: eli
contributor: ELI
subclass of: MediaObject
subclass of: Legislation
isPartOf: pending.schema.org
comment: A specific object or file containing a Legislation. Note that the same Legislation can be published in multiple files. For example, a digitally signed PDF, a plain PDF and an HTML version.

MedicalCondition
type: Class
isPartOf: health-lifesci.schema.org
comment: Any condition of the human body that affects the normal functioning of a person, whether physically or mentally. Includes diseases, injuries, disabilities, disorders, syndromes, etc.
subclass of: MedicalEntity

MoneyTransfer
type: Class
source: https://github.com/schemaorg/schemaorg/issues/1253
subclass of: TransferAction
contributor: FIBO
isPartOf: pending.schema.org
comment: The act of transferring money from one place to another place. This may occur electronically or physically.

CompoundPriceSpecification
type: Class
contributor: good-relations-and-schema-org
subclass of: PriceSpecification
comment: A compound price specification is one that bundles multiple prices that all apply in combination for different dimensions of consumption. Use the name property of the attached unit price specification for indicating the dimension of a price component (e.g. "electricity" or "final cleaning").

Specialty
type: Class
comment: Any branch of a field in which people typically develop specific expertise, usually after significant study, time, and effort.
subclass of: Enumeration

StatisticalVariable
type: Class
comment: StatisticalVariable represents any type of statistical metric that can be measured at a place and time. The usage pattern for StatisticalVariable is typically expressed using Observation with an explicit populationType, which is a type, typically drawn from Schema.org. Each StatisticalVariable is marked as a ConstraintNode, meaning that some properties (those listed using constraintProperty) serve in this setting solely to define the statistical variable rather than literally describe a specific person, place or thing. For example, a StatisticalVariable Median_Height_Person_Female representing the median height of women, could be written as follows: the population type is Person; the measuredProperty height; the statType median; the gender Female. It is important to note that there are many kinds of scientific quantitative observation which are not fully, perfectly or unambiguously described following this pattern, or with solely Schema.org terminology. The approach taken here is designed to allow partial, incremental or minimal description of StatisticalVariables, and the use of detailed sets of entity and property IDs from external repositories. The measurementMethod, unitCode and unitText properties can also be used to clarify the specific nature and notation of an observed measurement.
subclass of: ConstraintNode
isPartOf: pending.schema.org
source: https://github.com/schemaorg/schemaorg/issues/2564

Mass
type: Class
subclass of: Quantity
comment: Properties that take Mass as values are of the form '<Number> <Mass unit of measure>'. E.g., '7 kg'.

SeekToAction
type: Class
isPartOf: pending.schema.org
source: https://github.com/schemaorg/schemaorg/issues/2722
comment: This is the Action of navigating to a specific startOffset timestamp within a VideoObject, typically represented with a URL template structure.
subclass of: Action

DDxElement
type: Class
isPartOf: health-lifesci.schema.org
subclass of: MedicalIntangible
comment: An alternative, closely-related condition typically considered later in the differential diagnosis process along with the signs that are used to distinguish it.

makesOffer
type: Property
contributor: GoodRelationsTerms
domainIncludes: Person
domainIncludes: Organization
rangeIncludes: Offer
inverseOf: offeredBy
equivalent property: offers
comment: A pointer to products or services offered by the organization or person.

offeredBy
type: Property
equivalent property: isOfferedBy
inverseOf: makesOffer
comment: A pointer to the organization or person making the offer.
rangeIncludes: Person
rangeIncludes: Organization
domainIncludes: Offer

QuantitativeValue
type: Class
subclass of: StructuredValue
comment: A point value or interval for product characteristics and other purposes.
contributor: good-relations-and-schema-org

InsertAction
type: Class
subclass of: AddAction
comment: The act of adding at a specific location in an ordered collection.

Guide
type: Class
source: https://github.com/schemaorg/schemaorg/issues/2405
subclass of: CreativeWork
isPartOf: pending.schema.org
comment: Guide is a page or article that recommends specific products or services, or aspects of a thing for a user to consider. A Guide may represent a Buying Guide and detail aspects of products or services for a user to consider. A Guide may represent a Product Guide and recommend specific products or services. A Guide may represent a Ranked List and recommend specific products or services with ranking.

ReviewAction
type: Class
subclass of: AssessAction
comment: The act of producing a balanced opinion about the object for an audience. An agent reviews an object with participants resulting in a review.

TypeAndQuantityNode
type: Class
contributor: good-relations-and-schema-org
subclass of: StructuredValue
comment: A structured value indicating the quantity, unit of measurement, and business function of goods included in a bundle offer.

Collection
type: Class
comment: A collection of items, e.g. creative works or products.
subclass of: CreativeWork
isPartOf: bib.schema.org

owner
type: Property
comment: A person or organization who owns this Thing.
source: https://github.com/schemaorg/schemaorg/issues/4603
rangeIncludes: Person
rangeIncludes: Organization
domainIncludes: Thing
inverseOf: owns

owns
type: Property
equivalent property: owns
inverseOf: owner
domainIncludes: Person
domainIncludes: Organization
comment: Things owned by the organization or person.
rangeIncludes: Thing
contributor: GoodRelationsTerms
source: https://github.com/schemaorg/schemaorg/issues/4603

SuperficialAnatomy
type: Class
comment: Anatomical features that can be observed by sight (without dissection), including the form and proportions of the human body as well as surface landmarks that correspond to deeper subcutaneous structures. Superficial anatomy plays an important role in sports medicine, phlebotomy, and other medical specialties as underlying anatomical structures can be identified through surface palpation. For example, during back surgery, superficial anatomy can be used to palpate and count vertebrae to find the site of incision. Or in phlebotomy, superficial anatomy can be used to locate an underlying vein; for example, the median cubital vein can be located by palpating the borders of the cubital fossa (such as the epicondyles of the humerus) and then looking for the superficial signs of the vein, such as size, prominence, ability to refill after depression, and feel of surrounding tissue support. As another example, in a subluxation (dislocation) of the glenohumeral joint, the bony structure becomes pronounced with the deltoid muscle failing to cover the glenohumeral joint allowing the edges of the scapula to be superficially visible. Here, the superficial anatomy is the visible edges of the scapula, implying the underlying dislocation of the joint (the related anatomical structure).
subclass of: MedicalEntity
isPartOf: health-lifesci.schema.org

TextObject
type: Class
comment: A text file. The text can be unformatted or contain markup, html, etc.
equivalent class: Text
subclass of: MediaObject

PaymentStatusType
type: Class
comment: A specific payment status. For example, PaymentDue, PaymentComplete, etc.
subclass of: StatusEnumeration

MoveAction
type: Class
subclass of: Action
comment: The act of an agent relocating to a place.\n\nRelated actions:\n\n* TransferAction: Unlike TransferAction, the subject of the move is a living Person or Organization rather than an inanimate object.

ServicePeriod
type: Class
subclass of: StructuredValue
comment: ServicePeriod represents a duration with some constraints about cutoff time and business days. This is used e.g. in shipping for handling times or transit time.
isPartOf: pending.schema.org
source: https://github.com/schemaorg/schemaorg/issues/3617

ProductModel
type: Class
subclass of: Product
comment: A datasheet or vendor specification of a product (in the sense of a prototypical description).
contributor: good-relations-and-schema-org

providesBroadcastService
type: Property
rangeIncludes: BroadcastService
inverseOf: hasBroadcastChannel
comment: The BroadcastService offered on this channel.
domainIncludes: BroadcastChannel

hasBroadcastChannel
type: Property
domainIncludes: BroadcastService
rangeIncludes: BroadcastChannel
inverseOf: providesBroadcastService
source: https://github.com/schemaorg/schemaorg/issues/1004
comment: A broadcast channel of a broadcast service.

Nerve
type: Class
comment: A common pathway for the electrochemical nerve impulses that are transmitted along each of the axons.
subclass of: AnatomicalStructure
isPartOf: health-lifesci.schema.org

LegalValueLevel
type: Class
source: eli
source: https://github.com/schemaorg/schemaorg/issues/1156
subclass of: Enumeration
comment: A list of possible levels for the legal validity of a legislation.
contributor: ELI
isPartOf: pending.schema.org

MedicalCode
type: Class
comment: A code for a medical entity.
isPartOf: health-lifesci.schema.org
subclass of: MedicalIntangible
subclass of: CategoryCode

GiveAction
type: Class
comment: The act of transferring ownership of an object to a destination. Reciprocal of TakeAction.\n\nRelated actions:\n\n* TakeAction: Reciprocal of GiveAction.\n* SendAction: Unlike SendAction, GiveAction implies that ownership is being transferred (e.g. I may send my laptop to you, but that doesn't mean I'm giving it to you).
subclass of: TransferAction

PublicationEvent
type: Class
comment: A PublicationEvent corresponds indifferently to the event of publication for a CreativeWork of any type, e.g. a broadcast event, an on-demand event, a book/journal publication via a variety of delivery media.
subclass of: Event

Car
type: Class
subclass of: Vehicle
comment: A car is a wheeled, self-powered motor vehicle used for transportation.
contributor: Automotive Ontology Working Group

LoanOrCredit
type: Class
contributor: FIBO
subclass of: FinancialProduct
comment: A financial product for the loaning of an amount of money, or line of credit, under agreed terms and charges.

MonetaryGrant
type: Class
comment: A monetary grant.
source: FundInfoCollab
source: https://github.com/schemaorg/schemaorg/issues/383
isPartOf: pending.schema.org
subclass of: Grant

MedicalDevicePurpose
type: Class
isPartOf: health-lifesci.schema.org
subclass of: MedicalEnumeration
comment: Categories of medical devices, organized by the purpose or intended use of the device.

albumRelease
type: Property
domainIncludes: MusicAlbum
rangeIncludes: MusicRelease
comment: A release of this album.
inverseOf: releaseOf

releaseOf
type: Property
contributor: MBZ
domainIncludes: MusicRelease
comment: The album this is a release of.
rangeIncludes: MusicAlbum
inverseOf: albumRelease

exampleOfWork
type: Property
inverseOf: workExample
domainIncludes: CreativeWork
comment: A creative work that this work is an example/instance/realization/derivation of.
contributor: bibex
rangeIncludes: CreativeWork

MemberProgramTier
type: Class
comment: A MemberProgramTier specifies a tier under a loyalty (member) program, for example "gold".
isPartOf: pending.schema.org
source: https://github.com/schemaorg/schemaorg/issues/3563
subclass of: Intangible

ParcelDelivery
type: Class
comment: The delivery of a parcel either via the postal service or a commercial service.
subclass of: Intangible

TipAction
type: Class
comment: The act of giving money voluntarily to a beneficiary in recognition of services rendered.
subclass of: TradeAction

BusStation
type: Class
subclass of: CivicStructure
comment: A bus station.

ReplyAction
type: Class
comment: The act of responding to a question/message asked/sent by the object. Related to AskAction.\n\nRelated actions:\n\n* AskAction: Appears generally as an origin of a ReplyAction.
subclass of: CommunicateAction

SolveMathAction
type: Class
comment: The action that takes in a math expression and directs users to a page potentially capable of solving/simplifying that expression.
isPartOf: pending.schema.org
source: https://github.com/schemaorg/schemaorg/issues/2740
subclass of: Action

StructuredValue
type: Class
comment: Structured values are used when the value of a property has a more complex structure than simply being a textual value or a reference to another thing.
subclass of: Intangible

HealthAndBeautyBusiness
type: Class
subclass of: LocalBusiness
comment: Health and beauty.

Message
type: Class
comment: A single message from a sender to one or more organizations or people.
subclass of: CreativeWork

RsvpAction
type: Class
subclass of: InformAction
comment: The act of notifying an event organizer as to whether you expect to attend the event.

ReturnMethodEnumeration
type: Class
comment: Enumerates several types of product return methods.
isPartOf: pending.schema.org
subclass of: Enumeration
source: https://github.com/schemaorg/schemaorg/issues/2880

DrugPrescriptionStatus
type: Class
isPartOf: health-lifesci.schema.org
subclass of: MedicalEnumeration
comment: Indicates whether this drug is available by prescription or over-the-counter.

DataFeedItem
type: Class
comment: A single item within a larger data feed.
subclass of: Intangible

ArchiveOrganization
type: Class
isPartOf: pending.schema.org
comment: An organization with archival holdings. An organization which keeps and preserves archival material and typically makes it accessible to the public.
subclass of: LocalBusiness
source: https://github.com/schemaorg/schemaorg/issues/1758

Room
type: Class
subclass of: Accommodation
comment: A room is a distinguishable space within a structure, usually separated from other spaces by interior walls (source: Wikipedia, the free encyclopedia, see http://en.wikipedia.org/wiki/Room). See also the dedicated document on the use of schema.org for marking up hotels and other forms of accommodations.
contributor: STI Accommodation Ontology

ActionStatusType
type: Class
subclass of: StatusEnumeration
comment: The status of an Action.

CarUsageType
type: Class
isPartOf: auto.schema.org
subclass of: Enumeration
comment: A value indicating a special usage of a car, e.g. commercial rental, driving school, or as a taxi.
contributor: Automotive Ontology Working Group

OwnershipInfo
type: Class
comment: A structured value providing information about when a certain organization or person owned a certain product.
subclass of: StructuredValue
contributor: good-relations-and-schema-org

ExercisePlan
type: Class
subclass of: PhysicalActivity
subclass of: CreativeWork
comment: Fitness-related activity designed for a specific health-related purpose, including defined exercise routines as well as activity prescribed by a clinician.
isPartOf: health-lifesci.schema.org

SizeSystemEnumeration
type: Class
source: https://github.com/schemaorg/schemaorg/issues/2811
subclass of: Enumeration
isPartOf: pending.schema.org
comment: Enumerates common size systems for different categories of products, for example "EN-13402" or "UK" for wearables or "Imperial" for screws.

MedicalContraindication
type: Class
comment: A condition or factor that serves as a reason to withhold a certain medical therapy. Contraindications can be absolute (there are no reasonable circumstances for undertaking a course of action) or relative (the patient is at higher risk of complications, but these risks may be outweighed by other considerations or mitigated by other measures).
subclass of: MedicalEntity
isPartOf: health-lifesci.schema.org

ClaimReview
type: Class
subclass of: Review
source: https://github.com/schemaorg/schemaorg/issues/1061
comment: A fact-checking review of claims made (or reported) in some creative work (referenced via itemReviewed).

MedicalScholarlyArticle
type: Class
isPartOf: health-lifesci.schema.org
subclass of: ScholarlyArticle
comment: A scholarly article in the medical domain.

GameServerStatus
type: Class
comment: Status of a game server.
subclass of: StatusEnumeration

MortgageLoan
type: Class
subclass of: LoanOrCredit
comment: A loan in which property or real estate is used as collateral. (A loan securitized against some real estate.)
source: https://github.com/schemaorg/schemaorg/issues/1253
contributor: FIBO
isPartOf: pending.schema.org

RadioSeries
type: Class
subclass of: CreativeWorkSeries
comment: CreativeWorkSeries dedicated to radio broadcast and associated online delivery.

subOrganization
type: Property
domainIncludes: Organization
equivalent property: hasSubsidiary
equivalent property: subOrganization
inverseOf: parentOrganization
rangeIncludes: Organization
comment: A relationship between two organizations where the first includes the second, e.g., as a subsidiary. See also: the more specific 'department' property.

Organization
type: Class
equivalent class: Organization
comment: An organization such as a school, NGO, corporation, club, etc.
subclass of: Thing

VideoObject
type: Class
comment: A video file.
contributor: rNews
subclass of: MediaObject

ImagingTest
type: Class
subclass of: MedicalTest
comment: Any medical imaging modality typically used for diagnostic purposes.
isPartOf: health-lifesci.schema.org

BroadcastEvent
type: Class
comment: An over the air or online broadcast event.
subclass of: PublicationEvent

HealthPlanNetwork
type: Class
comment: A US-style health insurance plan network.
isPartOf: pending.schema.org
source: https://github.com/schemaorg/schemaorg/issues/1062
subclass of: Intangible

SizeGroupEnumeration
type: Class
source: https://github.com/schemaorg/schemaorg/issues/2811
comment: Enumerates common size groups for various product categories.
subclass of: Enumeration
isPartOf: pending.schema.org

TravelAction
type: Class
comment: The act of traveling from a fromLocation to a destination by a specified mode of transport, optionally with participants.
subclass of: MoveAction

OrderAction
type: Class
comment: An agent orders an object/product/service to be delivered/sent.
subclass of: TradeAction

offers
type: Property
domainIncludes: Service
domainIncludes: MenuItem
domainIncludes: Product
domainIncludes: AggregateOffer
domainIncludes: EducationalOccupationalProgram
domainIncludes: Event
domainIncludes: Trip
domainIncludes: CreativeWork
inverseOf: itemOffered
rangeIncludes: Offer
rangeIncludes: Demand
source: https://github.com/schemaorg/schemaorg/issues/2289
comment: An offer to provide this item—for example, an offer to sell a product, rent the DVD of a movie, perform a service, or give away tickets to an event. Use businessFunction to indicate the kind of transaction offered, i.e. sell, lease, etc. This property can also be used to describe a Demand. While this property is listed as expected on a number of common types, it can be used in others. In that case, using a second type, such as Product or a subtype of Product, can clarify the nature of the offer.
equivalent property: isProductOf

itemOffered
type: Property
domainIncludes: Demand
domainIncludes: Offer
rangeIncludes: Product
rangeIncludes: Event
rangeIncludes: AggregateOffer
rangeIncludes: Trip
rangeIncludes: CreativeWork
rangeIncludes: Service
rangeIncludes: MenuItem
comment: An item being offered (or demanded). The transactional nature of the offer or demand is documented using businessFunction, e.g. sell, lease etc. While several common expected types are listed explicitly in this definition, others can be used. Using a second type, such as Product or a subtype of Product, can clarify the nature of the offer.
inverseOf: offers

LegalService
type: Class
comment: A LegalService is a business that provides legally-oriented services, advice and representation, e.g. law firms.\n\nAs a LocalBusiness it can be described as a provider of one or more Service\(s).
subclass of: LocalBusiness

Accommodation
type: Class
subclass of: Place
contributor: STI Accommodation Ontology
comment: An accommodation is a place that can accommodate human beings, e.g. a hotel room, a camping pitch, or a meeting room. Many accommodations are for overnight stays, but this is not a mandatory requirement. For more specific types of accommodations not defined in schema.org, one can use additionalType with external vocabularies. See also the dedicated document on the use of schema.org for marking up hotels and other forms of accommodations.

Dataset
type: Class
equivalent class: Dataset
comment: A body of structured information describing some topic(s) of interest.
contributor: DatasetClass
subclass of: CreativeWork

FinancialIncentive
type: Class
isPartOf: pending.schema.org
source: https://github.com/schemaorg/schemaorg/issues/3572
comment: Represents financial incentives for goods/services offered by an organization (or individual). Typically contains the name of the incentive, the incentivizedItem, the incentiveAmount, the incentiveStatus, incentiveType, the provider of the incentive, and eligibleWithSupplier. Optionally contains criteria on whether the incentive is limited based on purchaseType, purchasePriceLimit, incomeLimit, and the qualifiedExpense.
subclass of: Intangible

CertificationStatusEnumeration
type: Class
source: https://github.com/schemaorg/schemaorg/issues/3230
comment: Enumerates the different statuses of a Certification (Active and Inactive).
subclass of: Enumeration
isPartOf: pending.schema.org

TVSeries
type: Class
subclass of: CreativeWork
subclass of: CreativeWorkSeries
comment: CreativeWorkSeries dedicated to TV broadcast and associated online delivery.

FinancialService
type: Class
subclass of: LocalBusiness
comment: Financial services business.

Certification
type: Class
subclass of: Certificate
subclass of: CreativeWork
equivalent class: CertificationDetails
equivalent class: SpecifiedCertificate
source: https://github.com/schemaorg/schemaorg/issues/3230
isPartOf: pending.schema.org
comment: A Certification is an official and authoritative statement about a subject, for example a product, service, person, or organization. A certification is typically issued by an indendent certification body, for example a professional organization or government. It formally attests certain characteristics about the subject, for example Organizations can be ISO certified, Food products can be certified Organic or Vegan, a Person can be a certified professional, a Place can be certified for food processing. There are certifications for many domains: regulatory, organizational, recycling, food, efficiency, educational, ecological, etc. A certification is a form of credential, as are accreditations and licenses. Mapped from the [gs1:CertificationDetails](https://www.gs1.org/voc/CertificationDetails) class in the GS1 Web Vocabulary.

HotelRoom
type: Class
contributor: STI Accommodation Ontology
subclass of: Room
comment: A hotel room is a single room in a hotel. See also the dedicated document on the use of schema.org for marking up hotels and other forms of accommodations.

LinkRole
type: Class
subclass of: Role
isPartOf: pending.schema.org
comment: A Role that represents a Web link, e.g. as expressed via the 'url' property. Its linkRelationship property can indicate URL-based and plain textual link types, e.g. those in IANA link registry or others such as 'amphtml'. This structure provides a placeholder where details from HTML's link element can be represented outside of HTML, e.g. in JSON-LD feeds.
source: https://github.com/schemaorg/schemaorg/issues/1045

MusicPlaylist
type: Class
subclass of: CreativeWork
comment: A collection of music tracks in playlist form.

ItemAvailability
type: Class
comment: A list of possible product availability options.
subclass of: Enumeration

Ticket
type: Class
comment: Used to describe a ticket to an event, a flight, a bus ride, etc.
subclass of: Intangible

DeliveryChargeSpecification
type: Class
comment: The price for the delivery of an offer using a particular delivery method.
contributor: good-relations-and-schema-org
subclass of: PriceSpecification

AdultOrientedEnumeration
type: Class
subclass of: Enumeration
isPartOf: pending.schema.org
source: https://github.com/schemaorg/schemaorg/issues/2989
comment: Enumeration of considerations that make a product relevant or potentially restricted for adults only.

ContactPointOption
type: Class
subclass of: Enumeration
comment: Enumerated options related to a ContactPoint.

MenuItem
type: Class
subclass of: Intangible
comment: A food or drink item listed in a menu or menu section.

ProductGroup
type: Class
subclass of: Classifier
subclass of: Collection
subclass of: Product
comment: A ProductGroup represents a group of Products that vary only in certain well-described ways, such as by size, color, material etc. While a ProductGroup itself is not directly offered for sale, the various varying products that it represents can be. The ProductGroup serves as a prototype or template, standing in for all of the products who have an isVariantOf relationship to it. As such, properties (including additional types) can be applied to the ProductGroup to represent characteristics shared by each of the (possibly very many) variants. Properties that reference a ProductGroup are not included in this mechanism; neither are the following specific properties variesBy, hasVariant, url.
isPartOf: pending.schema.org
source: https://github.com/schemaorg/schemaorg/issues/1797

BoardingPolicyType
type: Class
subclass of: Enumeration
comment: A type of boarding policy used by an airline.

DataCatalog
type: Class
equivalent class: Catalog
contributor: DatasetClass
subclass of: CreativeWork
comment: A collection of datasets.

PlayGameAction
type: Class
comment: The act of playing a video game.
subclass of: ConsumeAction
isPartOf: pending.schema.org
source: https://github.com/schemaorg/schemaorg/issues/3058

TVEpisode
type: Class
comment: A TV episode which can be part of a series or season.
subclass of: Episode

Report
type: Class
subclass of: Article
comment: A Report generated by governmental or non-governmental organization.

BusStop
type: Class
comment: A bus stop.
subclass of: CivicStructure

InviteAction
type: Class
subclass of: CommunicateAction
comment: The act of asking someone to attend an event. Reciprocal of RsvpAction.

MenuSection
type: Class
subclass of: CreativeWork
comment: A sub-grouping of food or drink items in a menu. E.g. courses (such as 'Dinner', 'Breakfast', etc.), specific type of dishes (such as 'Meat', 'Vegan', 'Drinks', etc.), or some other classification made by the menu provider.

CreativeWork
type: Class
contributor: rNews
comment: The most generic kind of creative work, including books, movies, photographs, software programs, etc.
subclass of: Thing

VideoGameSeries
type: Class
subclass of: CreativeWorkSeries
comment: A video game series.

MedicalWebPage
type: Class
comment: A web page that provides medical information.
isPartOf: health-lifesci.schema.org
subclass of: WebPage

FinancialProduct
type: Class
comment: A product provided to consumers and businesses by financial institutions such as banks, insurance companies, brokerage firms, consumer finance companies, and investment companies which comprise the financial services industry.
subclass of: Service
contributor: FIBO

Drug
type: Class
subclass of: Substance
subclass of: Product
isPartOf: health-lifesci.schema.org
equivalent class: http://purl.bioontology.org/ontology/SNOMEDCT/410942007
comment: A chemical or biologic substance, used as a medical therapy, that has a physiological effect on an organism. Here the term drug is used interchangeably with the term medicine although clinical knowledge makes a clear difference between them.

Map
type: Class
comment: A map.
subclass of: CreativeWork

ContactPoint
type: Class
equivalent class: ContactPoint
equivalent class: VCard
comment: A contact point—for example, a Customer Complaints department.
subclass of: StructuredValue

LegalForceStatus
type: Class
isPartOf: pending.schema.org
comment: A list of possible statuses for the legal force of a legislation.
source: https://github.com/schemaorg/schemaorg/issues/1156
source: eli
contributor: ELI
subclass of: StatusEnumeration

CollectionPage
type: Class
subclass of: WebPage
comment: Web page type: Collection page.

WarrantyScope
type: Class
subclass of: Enumeration
contributor: good-relations-and-schema-org
comment: A range of services that will be provided to a customer free of charge in case of a defect or malfunction of a product.\n\nCommonly used values:\n\n* http://purl.org/goodrelations/v1#Labor-BringIn\n* http://purl.org/goodrelations/v1#PartsAndLabor-BringIn\n* http://purl.org/goodrelations/v1#PartsAndLabor-PickUp

PurchaseType
type: Class
source: https://github.com/schemaorg/schemaorg/issues/3572
isPartOf: pending.schema.org
comment: Enumerates a purchase type for an item.
subclass of: Enumeration

Store
type: Class
comment: A retail good store.
subclass of: LocalBusiness

AnatomicalStructure
type: Class
isPartOf: health-lifesci.schema.org
comment: Any part of the human body, typically a component of an anatomical system. Organs, tissues, and cells are all anatomical structures.
subclass of: MedicalEntity

ReplaceAction
type: Class
subclass of: UpdateAction
comment: The act of editing a recipient by replacing an old object with a new object.

GovernmentService
type: Class
subclass of: Service
comment: A service provided by a government organization, e.g. food stamps, veterans benefits, etc.

QuantitativeValueDistribution
type: Class
comment: A statistical distribution of values.
subclass of: StructuredValue
source: https://github.com/schemaorg/schemaorg/issues/1698

MedicalEvidenceLevel
type: Class
comment: Level of evidence for a medical guideline. Enumerated type.
isPartOf: health-lifesci.schema.org
subclass of: MedicalEnumeration

recordedAt
type: Property
comment: The Event where the CreativeWork was recorded. The CreativeWork may capture all or part of the event.
rangeIncludes: Event
domainIncludes: CreativeWork
inverseOf: recordedIn

recordedIn
type: Property
inverseOf: recordedAt
comment: The CreativeWork that captured all or part of this Event.
domainIncludes: Event
rangeIncludes: CreativeWork

DrugClass
type: Class
subclass of: MedicalEntity
comment: A class of medical drugs, e.g., statins. Classes can represent general pharmacological class, common mechanisms of action, common physiological effects, etc.
isPartOf: health-lifesci.schema.org

QualitativeValue
type: Class
subclass of: Enumeration
contributor: good-relations-and-schema-org
comment: A predefined value for a product characteristic, e.g. the power cord plug type 'US' or the garment sizes 'S', 'M', 'L', and 'XL'.

Protein
type: Class
subclass of: BioChemEntity
isPartOf: pending.schema.org
source: bioschemas.org
comment: Protein is here used in its widest possible definition, as classes of amino acid based molecules. Amyloid-beta Protein in human (UniProt P05067), eukaryota (e.g. an OrthoDB group) or even a single molecule that one can point to are all of type :Protein. A protein can thus be a subclass of another protein, e.g. :Protein as a UniProt record can have multiple isoforms inside it which would also be :Protein. They can be imagined, synthetic, hypothetical or naturally occurring.

Physician
type: Class
comment: An individual physician or a physician's office considered as a MedicalOrganization.
subclass of: MedicalOrganization
subclass of: MedicalBusiness

HowToItem
type: Class
subclass of: ListItem
comment: An item used as either a tool or supply when performing the instructions for how to achieve a result.

Game
type: Class
comment: The Game type represents things which are games. These are typically rule-governed recreational activities, e.g. role-playing games in which players assume the role of characters in a fictional setting.
subclass of: CreativeWork

TierBenefitEnumeration
type: Class
subclass of: Enumeration
source: https://github.com/schemaorg/schemaorg/issues/3563
isPartOf: pending.schema.org
comment: An enumeration of possible benefits as part of a loyalty (members) program.

Course
type: Class
subclass of: LearningResource
subclass of: CreativeWork
comment: A description of an educational course which may be offered as distinct instances which take place at different times or take place at different locations, or be offered through different media or modes of study. An educational course is a sequence of one or more educational events and/or creative works which aims to build knowledge, competence or ability of learners.

EducationalOrganization
type: Class
comment: An educational organization.
subclass of: Organization
subclass of: CivicStructure

DeliveryMethod
type: Class
comment: A delivery method is a standardized procedure for transferring the product or service to the destination of fulfillment chosen by the customer. Delivery methods are characterized by the means of transportation used, and by the organization or group that is the contracting party for the sending organization or person.\n\nCommonly used values:\n\n* http://purl.org/goodrelations/v1#DeliveryModeDirectDownload\n* http://purl.org/goodrelations/v1#DeliveryModeFreight\n* http://purl.org/goodrelations/v1#DeliveryModeMail\n* http://purl.org/goodrelations/v1#DeliveryModeOwnFleet\n* http://purl.org/goodrelations/v1#DeliveryModePickUp\n* http://purl.org/goodrelations/v1#DHL\n* http://purl.org/goodrelations/v1#FederalExpress\n* http://purl.org/goodrelations/v1#UPS
contributor: good-relations-and-schema-org
equivalent class: TransportMethod
subclass of: Enumeration

OrganizationRole
type: Class
comment: A subclass of Role used to describe roles within organizations.
subclass of: Role

LifestyleModification
type: Class
comment: A process of care involving exercise, changes to diet, fitness routines, and other lifestyle changes aimed at improving a health condition.
isPartOf: health-lifesci.schema.org
subclass of: MedicalEntity

BoatTerminal
type: Class
isPartOf: pending.schema.org
subclass of: CivicStructure
source: https://github.com/schemaorg/schemaorg/issues/1755
comment: A terminal for boats, ships, and other water vessels.

WearableMeasurementTypeEnumeration
type: Class
comment: Enumerates common types of measurement for wearables products.
source: https://github.com/schemaorg/schemaorg/issues/2811
subclass of: MeasurementTypeEnumeration
isPartOf: pending.schema.org

DigitalPlatformEnumeration
type: Class
subclass of: Enumeration
isPartOf: pending.schema.org
source: https://github.com/schemaorg/schemaorg/issues/3057
comment: Enumerates some common technology platforms, for use with properties such as actionPlatform. It is not supposed to be comprehensive - when a suitable code is not enumerated here, textual or URL values can be used instead. These codes are at a fairly high level and do not deal with versioning and other nuance. Additional codes can be suggested [in github](https://github.com/schemaorg/schemaorg/issues/3057).

ProductCollection
type: Class
isPartOf: pending.schema.org
source: https://github.com/schemaorg/schemaorg/issues/2597
subclass of: Product
subclass of: Collection
comment: A set of products (either ProductGroups or specific variants) that are listed together e.g. in an Offer.

WebAPI
type: Class
source: https://github.com/schemaorg/schemaorg/issues/1423
subclass of: Service
comment: An application programming interface accessible over Web/Internet technologies.
isPartOf: pending.schema.org

MemberProgram
type: Class
subclass of: Intangible
comment: A MemberProgram defines a loyalty (or membership) program that provides its members with certain benefits, for example better pricing, free shipping or returns, or the ability to earn loyalty points. Member programs may have multiple tiers, for example silver and gold members, each with different benefits.
isPartOf: pending.schema.org
source: https://github.com/schemaorg/schemaorg/issues/3563

GovernmentBenefitsType
type: Class
comment: GovernmentBenefitsType enumerates several kinds of government benefits to support the COVID-19 situation. Note that this structure may not capture all benefits offered.
subclass of: Enumeration
isPartOf: pending.schema.org
source: https://github.com/schemaorg/schemaorg/issues/2534

Artery
type: Class
equivalent class: http://purl.bioontology.org/ontology/SNOMEDCT/51114001
subclass of: Vessel
comment: A type of blood vessel that specifically carries blood away from the heart.
isPartOf: health-lifesci.schema.org

PaymentCard
type: Class
contributor: FIBO
equivalent class: FinancialCard
subclass of: FinancialProduct
subclass of: PaymentMethod
comment: A payment method using a credit, debit, store or other card to associate the payment with an account.

about
type: Property
domainIncludes: CommunicateAction
domainIncludes: Certification
domainIncludes: DefinedTermSet
domainIncludes: Event
domainIncludes: CreativeWork
domainIncludes: DefinedTerm
comment: The subject matter of an object.
source: https://github.com/schemaorg/schemaorg/issues/4588
source: https://github.com/schemaorg/schemaorg/issues/1670
inverseOf: subjectOf
rangeIncludes: Thing

subjectOf
type: Property
domainIncludes: Thing
rangeIncludes: Event
rangeIncludes: CreativeWork
inverseOf: about
comment: A CreativeWork or Event about this Thing.
source: https://github.com/schemaorg/schemaorg/issues/1670

Article
type: Class
contributor: rNews
subclass of: CreativeWork
comment: An article, such as a news article or piece of investigative report. Newspapers and magazines have articles of many different types and this is intended to cover them all.\n\nSee also [blog post](https://blog.schema.org/2014/09/02/schema-org-support-for-bibliographic-relationships-and-periodicals/).

OpeningHoursSpecification
type: Class
contributor: good-relations-and-schema-org
comment: A structured value providing information about the opening hours of a place or a certain service inside a place.\n\n The place is __open__ if the opens property is specified, and __closed__ otherwise.\n\nIf the value for the closes property is less than the value for the opens property then the hour range is assumed to span over the next day.
subclass of: StructuredValue

BusinessAudience
type: Class
subclass of: Audience
comment: A set of characteristics belonging to businesses, e.g. who compose an item's target audience.

MedicalEnumeration
type: Class
comment: Enumerations related to health and the practice of medicine: A concept that is used to attribute a quality to another concept, as a qualifier, a collection of items or a listing of all of the elements of a set in medicine practice.
subclass of: Enumeration
isPartOf: health-lifesci.schema.org

URL
type: Class
subclass of: Text
comment: Data type: URL.

USNonprofitType
type: Class
isPartOf: pending.schema.org
subclass of: NonprofitType
source: https://github.com/schemaorg/schemaorg/issues/2543
comment: USNonprofitType: Non-profit organization type originating from the United States.

Episode
type: Class
comment: A media episode (e.g. TV, radio, video game) which can be part of a series or season.
subclass of: CreativeWork

IncentiveQualifiedExpenseType
type: Class
isPartOf: pending.schema.org
source: https://github.com/schemaorg/schemaorg/issues/3572
comment: The types of expenses that are covered by the incentive. For example some incentives are only for the goods (tangible items) but the services (labor) are excluded.
subclass of: Enumeration

SoftwareSourceCode
type: Class
subclass of: CreativeWork
comment: Computer programming source code. Example: Full (compile ready) solutions, code snippet samples, scripts, templates.

GeoShape
type: Class
subclass of: StructuredValue
comment: The geographic shape of a place. A GeoShape can be described using several properties whose values are based on latitude/longitude pairs. Either whitespace or commas can be used to separate latitude and longitude; whitespace should be used when writing a list of several such points.
contributor: rNews

DoseSchedule
type: Class
subclass of: MedicalIntangible
comment: A specific dosing schedule for a drug or supplement.
isPartOf: health-lifesci.schema.org

WarrantyPromise
type: Class
contributor: good-relations-and-schema-org
subclass of: MutualContractualAgreement
subclass of: StructuredValue
comment: A structured value representing the duration and scope of services that will be provided to a customer free of charge in case of a defect or malfunction of a product.

BoatTrip
type: Class
subclass of: Trip
comment: A trip on a commercial ferry line.
isPartOf: pending.schema.org
source: https://github.com/schemaorg/schemaorg/issues/1755

Project
type: Class
source: FundInfoCollab
source: https://github.com/schemaorg/schemaorg/issues/383
subclass of: Organization
isPartOf: pending.schema.org
comment: An enterprise (potentially individual but typically collaborative), planned to achieve a particular aim. Use properties from Organization, subOrganization/parentOrganization to indicate project sub-structures.

Taxon
type: Class
subclass of: Thing
isPartOf: pending.schema.org
comment: A set of organisms asserted to represent a natural cohesive biological unit.
source: bioschemas.org

Product
type: Class
contributor: GoodRelationsTerms
subclass of: Thing
comment: Any offered product or service. For example: a pair of shoes; a concert ticket; the rental of a car; a haircut; or an episode of a TV show streamed online.
equivalent class: Product
equivalent class: TradeProduct

Permit
type: Class
comment: A permit issued by an organization, e.g. a parking pass.
subclass of: Intangible

MedicalObservationalStudyDesign
type: Class
subclass of: MedicalEnumeration
isPartOf: health-lifesci.schema.org
comment: Design models for observational medical studies. Enumerated type.

UKNonprofitType
type: Class
source: https://github.com/schemaorg/schemaorg/issues/2543
subclass of: NonprofitType
comment: UKNonprofitType: Non-profit organization type originating from the United Kingdom.
isPartOf: pending.schema.org

PriceTypeEnumeration
type: Class
subclass of: Enumeration
isPartOf: pending.schema.org
source: https://github.com/schemaorg/schemaorg/issues/2712
comment: Enumerates different price types, for example list price, invoice price, and sale price.

AddAction
type: Class
subclass of: UpdateAction
comment: The act of editing by adding an object to a collection.

DayOfWeek
type: Class
contributor: good-relations-and-schema-org
subclass of: Enumeration
comment: The day of the week, e.g. used to specify to which day the opening hours of an OpeningHoursSpecification refer. Originally, URLs from [GoodRelations](http://purl.org/goodrelations/v1) were used (for Monday, Tuesday, Wednesday, Thursday, Friday, Saturday, Sunday plus a special entry for PublicHolidays); these have now been integrated directly into schema.org.

InteractAction
type: Class
comment: The act of interacting with another person or organization.
subclass of: Action

PostalCodeRangeSpecification
type: Class
source: https://github.com/schemaorg/schemaorg/issues/2506
subclass of: StructuredValue
comment: Indicates a range of postal codes, usually defined as the set of valid codes between postalCodeBegin and postalCodeEnd, inclusively.

Reservation
type: Class
subclass of: Intangible
comment: Describes a reservation for travel, dining or an event. Some reservations require tickets. \n\nNote: This type is for information about actual reservations, e.g. in confirmation emails or HTML pages with individual confirmations of reservations. For offers of tickets, restaurant reservations, flights, or rental cars, use Offer.

PodcastSeries
type: Class
subclass of: CreativeWorkSeries
isPartOf: pending.schema.org
source: https://github.com/schemaorg/schemaorg/issues/373
comment: A podcast is an episodic series of digital audio or video files which a user can download and listen to.

Muscle
type: Class
isPartOf: health-lifesci.schema.org
subclass of: AnatomicalStructure
comment: A muscle is an anatomical structure consisting of a contractile form of tissue that animals use to effect movement.

HealthPlanCostSharingSpecification
type: Class
comment: A description of costs to the patient under a given network or formulary.
isPartOf: pending.schema.org
source: https://github.com/schemaorg/schemaorg/issues/1062
subclass of: Intangible

SportsActivityLocation
type: Class
subclass of: LocalBusiness
comment: A sports location, such as a playing field.

TrainStation
type: Class
subclass of: CivicStructure
comment: A train station.

LiveBlogPosting
type: Class
comment: A LiveBlogPosting is a BlogPosting intended to provide a rolling textual coverage of an ongoing event through continuous updates.
subclass of: BlogPosting

DrugStrength
type: Class
subclass of: MedicalIntangible
isPartOf: health-lifesci.schema.org
comment: A specific strength in which a medical drug is available in a specific country.

IndividualProduct
type: Class
comment: A single, identifiable product instance (e.g. a laptop with a particular serial number).
subclass of: Product
disjoint with: ProductModel
equivalent class: SpecifiedTradeProduct
contributor: good-relations-and-schema-org

MedicalTherapy
type: Class
isPartOf: health-lifesci.schema.org
subclass of: TherapeuticProcedure
comment: Any medical intervention designed to prevent, treat, and cure human diseases and medical conditions, including both curative and palliative therapies. Medical therapies are typically processes of care relying upon pharmacotherapy, behavioral therapy, supportive therapy (with fluid or nutrition for example), or detoxification (e.g. hemodialysis) aimed at improving or preventing a health condition.

MediaReview
type: Class
comment: A MediaReview is a more specialized form of Review dedicated to the evaluation of media content online, typically in the context of fact-checking and misinformation. For more general reviews of media in the broader sense, use UserReview, CriticReview or other Review types. This definition is a work in progress. While the MediaManipulationRatingEnumeration list reflects significant community review amongst fact-checkers and others working to combat misinformation, the specific structures for representing media objects, their versions and publication context, are still evolving. Similarly, best practices for the relationship between MediaReview and ClaimReview markup have not yet been finalized.
source: https://github.com/schemaorg/schemaorg/issues/2450
subclass of: Review
isPartOf: pending.schema.org

MedicalObservationalStudy
type: Class
comment: An observational study is a type of medical study that attempts to infer the possible effect of a treatment through observation of a cohort of subjects over a period of time. In an observational study, the assignment of subjects into treatment groups versus control groups is outside the control of the investigator. This is in contrast with controlled studies, such as the randomized controlled trials represented by MedicalTrial, where each subject is randomly assigned to a treatment group or a control group before the start of the treatment.
isPartOf: health-lifesci.schema.org
subclass of: MedicalStudy

TechArticle
type: Class
subclass of: Article
comment: A technical article - Example: How-to (task) topics, step-by-step, procedural troubleshooting, specifications, etc.

EnergyEfficiencyEnumeration
type: Class
source: https://github.com/schemaorg/schemaorg/issues/2670
subclass of: Enumeration
isPartOf: pending.schema.org
comment: Enumerates energy efficiency levels (also known as "classes" or "ratings") and certifications that are part of several international energy efficiency standards.

LocationFeatureSpecification
type: Class
contributor: STI Accommodation Ontology
comment: Specifies a location feature by providing a structured value representing a feature of an accommodation as a property-value pair of varying degrees of formality.
subclass of: PropertyValue

MedicalAudienceType
type: Class
comment: Target audiences types for medical web pages. Enumerated type.
subclass of: MedicalEnumeration
isPartOf: health-lifesci.schema.org

WinAction
type: Class
comment: The act of achieving victory in a competitive activity.
subclass of: AchieveAction

PlayAction
type: Class
comment: The act of playing/exercising/training/performing for enjoyment, leisure, recreation, competition or exercise.\n\nRelated actions:\n\n* ListenAction: Unlike ListenAction (which is under ConsumeAction), PlayAction refers to performing for an audience or at an event, rather than consuming music.\n* WatchAction: Unlike WatchAction (which is under ConsumeAction), PlayAction refers to showing/displaying for an audience or at an event, rather than consuming visual content.
subclass of: Action

PerformingGroup
type: Class
comment: A performance group, such as a band, an orchestra, or a circus.
subclass of: Organization

isPartOfBioChemEntity
type: Property
source: www.bioschemas.org
rangeIncludes: BioChemEntity
inverseOf: hasBioChemEntityPart
comment: Indicates a BioChemEntity that is (in some sense) a part of this BioChemEntity.
domainIncludes: BioChemEntity
isPartOf: pending.schema.org

hasBioChemEntityPart
type: Property
domainIncludes: BioChemEntity
source: www.bioschemas.org
isPartOf: pending.schema.org
comment: Indicates a BioChemEntity that (in some sense) has this BioChemEntity as a part.
inverseOf: isPartOfBioChemEntity
rangeIncludes: BioChemEntity

MedicalRiskScore
type: Class
comment: A simple system that adds up the number of risk factors to yield a score that is associated with prognosis, e.g. CHAD score, TIMI risk score.
isPartOf: health-lifesci.schema.org
subclass of: MedicalRiskEstimator

CategoryCode
type: Class
isPartOf: pending.schema.org
source: https://github.com/schemaorg/schemaorg/issues/894
comment: A Category Code.
subclass of: DefinedTerm

WebApplication
type: Class
subclass of: SoftwareApplication
comment: Web applications.

Landform
type: Class
subclass of: Place
comment: A landform or physical feature. Landform elements include mountains, plains, lakes, rivers, seascape and oceanic waterbody interface features such as bays, peninsulas, seas and so forth, including sub-aqueous terrain features such as submersed mountain ranges, volcanoes, and the great ocean basins.

AboutPage
type: Class
comment: Web page type: About page.
subclass of: WebPage

Brand
type: Class
subclass of: Intangible
subclass of: Classifier
contributor: good-relations-and-schema-org
equivalent class: BrandName
comment: A brand is a name used by an organization or business person for labeling a product, product group, or similar.

containsPlace
type: Property
rangeIncludes: Place
inverseOf: containedInPlace
comment: The basic containment relation between a place and another that it contains.
domainIncludes: Place

HowTo
type: Class
subclass of: CreativeWork
comment: Instructions that explain how to achieve a result by performing a sequence of steps.

CableOrSatelliteService
type: Class
subclass of: Service
comment: A service which provides access to media programming like TV or radio. Access may be via cable or satellite.

EventAttendanceModeEnumeration
type: Class
subclass of: Enumeration
comment: An EventAttendanceModeEnumeration value is one of potentially several modes of organising an event, relating to whether it is online or offline.
isPartOf: pending.schema.org
source: https://github.com/schemaorg/schemaorg/issues/1842

PlaceOfWorship
type: Class
comment: Place of worship, such as a church, synagogue, or mosque.
subclass of: CivicStructure

UserInteraction
type: Class
supersededBy: InteractionCounter
subclass of: Event
comment: UserInteraction and its subtypes is an old way of talking about users interacting with pages. It is generally better to use Action-based vocabulary, alongside types such as Comment.

WebPageElement
type: Class
comment: A web page element, like a table or an image.
subclass of: CreativeWork

WebContent
type: Class
comment: WebContent is a type representing all WebPage, WebSite and WebPageElement content. It is sometimes the case that detailed distinctions between Web pages, sites and their parts are not always important or obvious. The WebContent type makes it easier to describe Web-addressable content without requiring such distinctions to always be stated. (The intent is that the existing types WebPage, WebSite and WebPageElement will eventually be declared as subtypes of WebContent.)
subclass of: CreativeWork
source: https://github.com/schemaorg/schemaorg/issues/2358
isPartOf: pending.schema.org

EducationalAudience
type: Class
subclass of: Audience
contributor: LRMIClass
comment: An EducationalAudience.

SportsEvent
type: Class
comment: Event type: Sports event.
subclass of: Event

IndividualPhysician
type: Class
comment: An individual medical practitioner. For their official address use address, for affiliations to hospitals use hospitalAffiliation. The practicesAt property can be used to indicate MedicalOrganization hospitals, clinics, pharmacies etc. where this physician practices.
subclass of: Physician

TaxiService
type: Class
subclass of: Service
comment: A service for a vehicle for hire with a driver for local travel. Fares are usually calculated based on distance traveled.

Rating
type: Class
comment: A rating is an evaluation on a numeric scale, such as 1 to 5 stars.
subclass of: Intangible

MusicComposition
type: Class
comment: A musical composition.
contributor: MBZ
subclass of: CreativeWork

subTrip
type: Property
contributor: Tourism
inverseOf: partOfTrip
source: https://github.com/schemaorg/schemaorg/issues/1810
isPartOf: pending.schema.org
rangeIncludes: Trip
domainIncludes: Trip
comment: Identifies a Trip that is a subTrip of this Trip. For example Day 1, Day 2, etc. of a multi-day trip.

partOfTrip
type: Property
inverseOf: subTrip
comment: Identifies that this Trip is a subTrip of another Trip. For example Day 1, Day 2, etc. of a multi-day trip.
contributor: Tourism
source: https://github.com/schemaorg/schemaorg/issues/1810
isPartOf: pending.schema.org
domainIncludes: Trip
rangeIncludes: Trip

ReservationStatusType
type: Class
subclass of: StatusEnumeration
comment: Enumerated status values for Reservation.

Invoice
type: Class
equivalent class: Invoice
subclass of: LegalDocument
subclass of: Intangible
comment: A statement of the money due for goods or services; a bill.

Thing
type: Class
comment: The most generic type of item.

MolecularEntity
type: Class
isPartOf: pending.schema.org
source: bioschemas.org
subclass of: BioChemEntity
comment: Any constitutionally or isotopically distinct atom, molecule, ion, ion pair, radical, radical ion, complex, conformer etc., identifiable as a separately distinguishable entity.

Place
type: Class
comment: Entities that have a somewhat fixed, physical extension.
subclass of: Thing
equivalent class: Location

Gene
type: Class
source: bioschemas.org
subclass of: BioChemEntity
isPartOf: pending.schema.org
comment: A discrete unit of inheritance which affects one or more biological traits (Source: [https://en.wikipedia.org/wiki/Gene](https://en.wikipedia.org/wiki/Gene)). Examples include FOXP2 (Forkhead box protein P2), SCARNA21 (small Cajal body-specific RNA 21), A- (agouti genotype).

AggregateRating
type: Class
subclass of: Rating
comment: The average rating based on multiple ratings or reviews.

ShippingRateSettings
type: Class
comment: A ShippingRateSettings represents re-usable pieces of shipping information. It is designed for publication on an URL that may be referenced via the shippingSettingsLink property of an OfferShippingDetails. Several occurrences can be published, distinguished and matched (i.e. identified/referenced) by their different values for shippingLabel.
subclass of: StructuredValue
source: https://github.com/schemaorg/schemaorg/issues/2506

BlogPosting
type: Class
subclass of: SocialMediaPosting
comment: A blog post.

HomeAndConstructionBusiness
type: Class
subclass of: LocalBusiness
comment: A construction business.\n\nA HomeAndConstructionBusiness is a LocalBusiness that provides services around homes and buildings.\n\nAs a LocalBusiness it can be described as a provider of one or more Service\(s).

DataType
type: Class
subclass of: Class
comment: The basic data types such as Integers, Strings, etc.

DonateAction
type: Class
comment: The act of providing goods, services, or money without compensation, often for philanthropic reasons.
subclass of: TransferAction

Diet
type: Class
subclass of: CreativeWork
subclass of: LifestyleModification
comment: A strategy of regulating the intake of food to achieve or maintain a specific health-related goal.
isPartOf: health-lifesci.schema.org

EnergyStarEnergyEfficiencyEnumeration
type: Class
isPartOf: pending.schema.org
source: https://github.com/schemaorg/schemaorg/issues/2670
comment: Used to indicate whether a product is EnergyStar certified.
subclass of: EnergyEfficiencyEnumeration

Person
type: Class
comment: A person (alive, dead, undead, or fictional).
contributor: rNews
subclass of: Thing
equivalent class: Person

PhysicalActivityCategory
type: Class
isPartOf: health-lifesci.schema.org
comment: Categories of physical activity, organized by physiologic classification.
subclass of: Enumeration

CreativeWorkSeason
type: Class
comment: A media season, e.g. TV, radio, video game etc.
subclass of: CreativeWork

SportsTeam
type: Class
subclass of: SportsOrganization
comment: Organization: Sports team.

SportsOrganization
type: Class
comment: Represents the collection of all sports organizations, including sports teams, governing bodies, and sports associations.
subclass of: Organization

ReactAction
type: Class
comment: The act of responding instinctively and emotionally to an object, expressing a sentiment.
subclass of: AssessAction

Patient
type: Class
equivalent class: http://purl.bioontology.org/ontology/SNOMEDCT/116154003
isPartOf: health-lifesci.schema.org
subclass of: MedicalAudience
subclass of: Person
comment: A patient is any person recipient of health care services.

CorrectionComment
type: Class
source: https://github.com/schemaorg/schemaorg/issues/1950
subclass of: Comment
isPartOf: pending.schema.org
comment: A comment that corrects CreativeWork.

encodesCreativeWork
type: Property
domainIncludes: MediaObject
rangeIncludes: CreativeWork
comment: The CreativeWork encoded by this media object.
inverseOf: encoding

TrackAction
type: Class
subclass of: FindAction
comment: An agent tracks an object for updates.\n\nRelated actions:\n\n* FollowAction: Unlike FollowAction, TrackAction refers to the interest on the location of innanimates objects.\n* SubscribeAction: Unlike SubscribeAction, TrackAction refers to the interest on the location of innanimate objects.

EmergencyService
type: Class
comment: An emergency service, such as a fire station or ER.
subclass of: LocalBusiness

FoodEstablishmentReservation
type: Class
subclass of: Reservation
comment: A reservation to dine at a food-related business.\n\nNote: This type is for information about actual reservations, e.g. in confirmation emails or HTML pages with individual confirmations of reservations.

ItemListOrderType
type: Class
comment: Enumerated for values for itemListOrder for indicating how an ordered ItemList is organized.
subclass of: Enumeration

ReturnFeesEnumeration
type: Class
subclass of: Enumeration
isPartOf: pending.schema.org
source: https://github.com/schemaorg/schemaorg/issues/2288
comment: Enumerates several kinds of policies for product return fees.

OrderStatus
type: Class
subclass of: StatusEnumeration
comment: Enumerated status values for Order.

CreativeWorkSeries
type: Class
subclass of: Series
subclass of: CreativeWork
comment: A CreativeWorkSeries in schema.org is a group of related items, typically but not necessarily of the same kind. CreativeWorkSeries are usually organized into some order, often chronological. Unlike ItemList which is a general purpose data structure for lists of things, the emphasis with CreativeWorkSeries is on published materials (written e.g. books and periodicals, or media such as TV, radio and games).\n\nSpecific subtypes are available for describing TVSeries, RadioSeries, MovieSeries, BookSeries, Periodical and VideoGameSeries. In each case, the hasPart / isPartOf properties can be used to relate the CreativeWorkSeries to its parts. The general CreativeWorkSeries type serves largely just to organize these more specific and practical subtypes.\n\nIt is common for properties applicable to an item from the series to be usefully applied to the containing group. Schema.org attempts to anticipate some of these cases, but publishers should be free to apply properties of the series parts to the series as a whole wherever they seem appropriate.

Church
type: Class
subclass of: PlaceOfWorship
comment: A church.

VideoGame
type: Class
subclass of: SoftwareApplication
subclass of: Game
comment: A video game is an electronic game that involves human interaction with a user interface to generate visual feedback on a video device.

PropertyValue
type: Class
comment: A property-value pair, e.g. representing a feature of a product or place. Use the 'name' property for the name of the property. If there is an additional human-readable version of the value, put that into the 'description' property.\n\n Always use specific schema.org properties when a) they exist and b) you can populate them. Using PropertyValue as a substitute will typically not trigger the same effect as using the original, specific property.
subclass of: StructuredValue
contributor: good-relations-and-schema-org

TrainTrip
type: Class
subclass of: Trip
comment: A trip on a commercial train line.

CriticReview
type: Class
comment: A CriticReview is a more specialized form of Review written or published by a source that is recognized for its reviewing activities. These can include online columns, travel and food guides, TV and radio shows, blogs and other independent Web sites. CriticReviews are typically more in-depth and professionally written. For simpler, casually written user/visitor/viewer/customer reviews, it is more appropriate to use the UserReview type. Review aggregator sites such as Metacritic already separate out the site's user reviews from selected critic reviews that originate from third-party sources.
subclass of: Review
source: https://github.com/schemaorg/schemaorg/issues/1589
isPartOf: pending.schema.org

InfectiousDisease
type: Class
isPartOf: health-lifesci.schema.org
comment: An infectious disease is a clinically evident human disease resulting from the presence of pathogenic microbial agents, like pathogenic viruses, pathogenic bacteria, fungi, protozoa, multicellular parasites, and prions. To be considered an infectious disease, such pathogens are known to be able to cause this disease.
subclass of: MedicalCondition

IPTCDigitalSourceEnumeration
type: Class
isPartOf: pending.schema.org
comment: IPTC "Digital Source" codes for use with the digitalSourceType property, providing information about the source for a digital media object. In general these codes are not declared here to be mutually exclusive, although some combinations would be contradictory if applied simultaneously, or might be considered mutually incompatible by upstream maintainers of the definitions. See the IPTC documentation for detailed definitions of all terms.
subclass of: MediaEnumeration
source: https://github.com/schemaorg/schemaorg/issues/3392

Flight
type: Class
subclass of: Trip
comment: An airline flight.

Schedule
type: Class
source: https://github.com/schemaorg/schemaorg/issues/1457
isPartOf: pending.schema.org
comment: A schedule defines a repeating time period used to describe a regularly occurring Event. At a minimum a schedule will specify repeatFrequency which describes the interval between occurrences of the event. Additional information can be provided to specify the schedule more precisely. This includes identifying the day(s) of the week or month when the recurring event will take place, in addition to its start and end time. Schedules may also have start and end dates to indicate when they are active, e.g. to define a limited calendar of events.
subclass of: Intangible

ExerciseAction
type: Class
subclass of: PlayAction
comment: The act of participating in exertive activity for the purposes of improving health and fitness.

HealthAspectEnumeration
type: Class
subclass of: Enumeration
isPartOf: pending.schema.org
source: https://github.com/schemaorg/schemaorg/issues/2374
comment: HealthAspectEnumeration enumerates several aspects of health content online, each of which might be described using hasHealthAspect and HealthTopicContent.

SpecialAnnouncement
type: Class
comment: A SpecialAnnouncement combines a simple date-stamped textual information update with contextualized Web links and other structured data. It represents an information update made by a locally-oriented organization, for example schools, pharmacies, healthcare providers, community groups, police, local government. For work in progress guidelines on Coronavirus-related markup see [this doc](https://docs.google.com/document/d/14ikaGCKxo50rRM7nvKSlbUpjyIk2WMQd3IkB1lItlrM/edit#). The motivating scenario for SpecialAnnouncement is the [Coronavirus pandemic](https://en.wikipedia.org/wiki/2019%E2%80%9320_coronavirus_pandemic), and the initial vocabulary is oriented to this urgent situation. Schema.org expect to improve the markup iteratively as it is deployed and as feedback emerges from use. In addition to our usual [Github entry](https://github.com/schemaorg/schemaorg/issues/2490), feedback comments can also be provided in [this document](https://docs.google.com/document/d/1fpdFFxk8s87CWwACs53SGkYv3aafSxz_DTtOQxMrBJQ/edit#). While this schema is designed to communicate urgent crisis-related information, it is not the same as an emergency warning technology like [CAP](https://en.wikipedia.org/wiki/Common_Alerting_Protocol), although there may be overlaps. The intent is to cover the kinds of everyday practical information being posted to existing websites during an emergency situation. Several kinds of information can be provided: We encourage the provision of "name", "text", "datePosted", "expires" (if appropriate), "category" and "url" as a simple baseline. It is important to provide a value for "category" where possible, most ideally as a well known URL from Wikipedia or Wikidata. In the case of the 2019-2020 Coronavirus pandemic, this should be "https://en.wikipedia.org/w/index.php?title=2019-20\_coronavirus\_pandemic" or "https://www.wikidata.org/wiki/Q81068910". For many of the possible properties, values can either be simple links or an inline description, depending on…
subclass of: CreativeWork
isPartOf: pending.schema.org
source: https://github.com/schemaorg/schemaorg/issues/2490

AllocateAction
type: Class
comment: The act of organizing tasks/objects/events by associating resources to it.
subclass of: OrganizeAction

MerchantReturnPolicySeasonalOverride
type: Class
subclass of: Intangible
isPartOf: pending.schema.org
source: https://github.com/schemaorg/schemaorg/issues/2880
comment: A seasonal override of a return policy, for example used for holidays.

PriceComponentTypeEnumeration
type: Class
subclass of: Enumeration
isPartOf: pending.schema.org
source: https://github.com/schemaorg/schemaorg/issues/2689
comment: Enumerates different price components that together make up the total price for an offered product.

MedicalImagingTechnique
type: Class
subclass of: MedicalEnumeration
comment: Any medical imaging modality typically used for diagnostic purposes. Enumerated type.
isPartOf: health-lifesci.schema.org

DiagnosticLab
type: Class
subclass of: MedicalOrganization
comment: A medical laboratory that offers on-site or off-site diagnostic services.
isPartOf: health-lifesci.schema.org

ScreeningEvent
type: Class
subclass of: Event
comment: A screening of a movie or other video.

RefundTypeEnumeration
type: Class
comment: Enumerates several kinds of product return refund types.
subclass of: Enumeration
isPartOf: pending.schema.org
source: https://github.com/schemaorg/schemaorg/issues/2288

MedicalDevice
type: Class
isPartOf: health-lifesci.schema.org
subclass of: MedicalEntity
comment: Any object used in a medical capacity, such as to diagnose or treat a patient.
equivalent class: http://purl.bioontology.org/ontology/SNOMEDCT/63653004

Book
type: Class
subclass of: CreativeWork
comment: A book.

BroadcastChannel
type: Class
comment: A unique instance of a BroadcastService on a CableOrSatelliteService lineup.
subclass of: Intangible

PaymentMethod
type: Class
comment: A payment method is a standardized procedure for transferring the monetary amount for a purchase. Payment methods are characterized by the legal and technical structures used, and by the organization or group carrying out the transaction. The following legacy values should be accepted: \n\n* http://purl.org/goodrelations/v1#ByBankTransferInAdvance\n* http://purl.org/goodrelations/v1#ByInvoice\n* http://purl.org/goodrelations/v1#Cash\n* http://purl.org/goodrelations/v1#CheckInAdvance\n* http://purl.org/goodrelations/v1#COD\n* http://purl.org/goodrelations/v1#DirectDebit\n* http://purl.org/goodrelations/v1#GoogleCheckout\n* http://purl.org/goodrelations/v1#PayPal\n* http://purl.org/goodrelations/v1#PaySwarm\n\nStructured values, or [UNCE payment means](https://vocabulary.uncefact.org/PaymentMeans) are recommended or for newer annotations.
subclass of: Intangible
equivalent class: PaymentMeans
equivalent class: PaymentMechanism
source: https://github.com/schemaorg/schemaorg/issues/3537
contributor: good-relations-and-schema-org

BusTrip
type: Class
subclass of: Trip
comment: A trip on a commercial bus line.

DrugCost
type: Class
comment: The cost per unit of a medical drug. Note that this type is not meant to represent the price in an offer of a drug for sale; see the Offer type for that. This type will typically be used to tag wholesale or average retail cost of a drug, or maximum reimbursable cost. Costs of medical drugs vary widely depending on how and where they are paid for, so while this type captures some of the variables, costs should be used with caution by consumers of this schema's markup.
subclass of: MedicalEntity
isPartOf: health-lifesci.schema.org

Answer
type: Class
comment: An answer offered to a question; perhaps correct, perhaps opinionated or wrong.
subclass of: Comment
contributor: QAStackExchange

GenderType
type: Class
subclass of: Enumeration
comment: An enumeration of genders.

RealEstateAgent
type: Class
comment: A real-estate agent.
subclass of: LocalBusiness

Joint
type: Class
comment: The anatomical location at which two or more bones make contact.
subclass of: AnatomicalStructure
isPartOf: health-lifesci.schema.org

PublicationIssue
type: Class
subclass of: CreativeWork
equivalent class: Issue
comment: A part of a successively published publication such as a periodical or publication volume, often numbered, usually containing a grouping of works such as articles.\n\nSee also [blog post](https://blog-schema.org/2014/09/02/schema-org-support-for-bibliographic-relationships-and-periodicals/).
contributor: bibex

HyperTocEntry
type: Class
comment: A HyperToEntry is an item within a HyperToc, which represents a hypertext table of contents for complex media objects, such as VideoObject, AudioObject. The media object itself is indicated using associatedMedia. Each section of interest within that content can be described with a HyperTocEntry, with associated startOffset and endOffset. When several entries are all from the same file, associatedMedia is used on the overarching HyperTocEntry; if the content has been split into multiple files, they can be referenced using associatedMedia on each HyperTocEntry.
source: https://github.com/schemaorg/schemaorg/issues/2766
isPartOf: pending.schema.org
subclass of: CreativeWork

MusicReleaseFormatType
type: Class
comment: Format of this release (the type of recording media used, i.e. compact disc, digital media, LP, etc.).
contributor: MBZ
subclass of: Enumeration

OnlineMarketplace
type: Class
source: https://github.com/schemaorg/schemaorg/issues/4470
comment: An eCommerce marketplace.
isPartOf: pending.schema.org
subclass of: OnlineStore

MedicalSign
type: Class
isPartOf: health-lifesci.schema.org
subclass of: MedicalSignOrSymptom
comment: Any physical manifestation of a person's medical condition discoverable by objective diagnostic tests or physical examination.

BreadcrumbList
type: Class
subclass of: ItemList
comment: A BreadcrumbList is an ItemList consisting of a chain of linked Web pages, typically described using at least their URL and their name, and typically ending with the current page.\n\nThe position property is used to reconstruct the order of the items in a BreadcrumbList. The convention is that a breadcrumb list has an itemListOrder of ItemListOrderAscending (lower values listed first), and that the first items in this list correspond to the "top" or beginning of the breadcrumb trail, e.g. with a site or section homepage. The specific values of 'position' are not assigned meaning for a BreadcrumbList, but they should be integers, e.g. beginning with '1' for the first item in the list.

ComicIssue
type: Class
isPartOf: bib.schema.org
subclass of: PublicationIssue
comment: Individual comic issues are serially published as part of a larger series. For the sake of consistency, even one-shot issues belong to a series comprised of a single issue. All comic issues can be uniquely identified by: the combination of the name and volume number of the series to which the issue belongs; the issue number; and the variant description of the issue (if any).

AutomotiveBusiness
type: Class
comment: Car repair, sales, or parts.
subclass of: LocalBusiness

ScholarlyArticle
type: Class
subclass of: Article
comment: A scholarly article.

Corporation
type: Class
comment: Organization: A business corporation.
equivalent class: Corporation
subclass of: Organization
contributor: rNews

LodgingReservation
type: Class
subclass of: Reservation
comment: A reservation for lodging at a hotel, motel, inn, etc.\n\nNote: This type is for information about actual reservations, e.g. in confirmation emails or HTML pages with individual confirmations of reservations.

TransferAction
type: Class
subclass of: Action
comment: The act of transferring/moving (abstract or concrete) animate or inanimate objects from one place to another.

BodyOfWater
type: Class
subclass of: Landform
comment: A body of water, such as a sea, ocean, or lake.

MediaObject
type: Class
subclass of: CreativeWork
comment: A media object, such as an image, video, audio, or text object embedded in a web page or a downloadable dataset i.e. DataDownload. Note that a creative work may have many media objects associated with it on the same web page. For example, a page about a single song (MusicRecording) may have a music video (VideoObject), and a high and low bandwidth audio stream (2 AudioObject's).

AskAction
type: Class
subclass of: CommunicateAction
comment: The act of posing a question / favor to someone.\n\nRelated actions:\n\n* ReplyAction: Appears generally as a response to AskAction.

TVClip
type: Class
comment: A short TV program or a segment/part of a TV program.
subclass of: Clip

Error
type: Class
comment: Representation of an Error.
equivalent class: Error
source: https://github.com/schemaorg/schemaorg/issues/4579
isPartOf: pending.schema.org
subclass of: InstantaneousEvent
subclass of: Result

EngineSpecification
type: Class
comment: Information about the engine of the vehicle. A vehicle can have multiple engines represented by multiple engine specification entities.
contributor: Automotive Ontology Working Group
subclass of: StructuredValue

LymphaticVessel
type: Class
comment: A type of blood vessel that specifically carries lymph fluid unidirectionally toward the heart.
isPartOf: health-lifesci.schema.org
subclass of: Vessel

ReturnLabelSourceEnumeration
type: Class
comment: Enumerates several types of return labels for product returns.
isPartOf: pending.schema.org
subclass of: Enumeration
source: https://github.com/schemaorg/schemaorg/issues/2880

TouristAttraction
type: Class
comment: A tourist attraction. In principle any Thing can be a TouristAttraction, from a Mountain and LandmarksOrHistoricalBuildings to a LocalBusiness. This Type can be used on its own to describe a general TouristAttraction, or be used as an additionalType to add tourist attraction properties to any other type. (See examples below)
subclass of: Place
contributor: Tourism
contributor: IIT-CNR.it

Residence
type: Class
subclass of: Place
comment: The place where a person lives.

JoinAction
type: Class
comment: An agent joins an event/group with participants/friends at a location.\n\nRelated actions:\n\n* RegisterAction: Unlike RegisterAction, JoinAction refers to joining a group/team of people.\n* SubscribeAction: Unlike SubscribeAction, JoinAction does not imply that you'll be receiving updates.\n* FollowAction: Unlike FollowAction, JoinAction does not imply that you'll be polling for updates.
subclass of: InteractAction

ActionAccessSpecification
type: Class
source: https://github.com/schemaorg/schemaorg/issues/1741
subclass of: Intangible
comment: A set of requirements that must be fulfilled in order to perform an Action.

PublicationVolume
type: Class
comment: A part of a successively published publication such as a periodical or multi-volume work, often numbered. It may represent a time span, such as a year.\n\nSee also [blog post](https://blog-schema.org/2014/09/02/schema-org-support-for-bibliographic-relationships-and-periodicals/).
contributor: bibex
subclass of: CreativeWork

MeasurementMethodEnum
type: Class
isPartOf: pending.schema.org
subclass of: Enumeration
comment: Enumeration(s) for use with measurementMethod.
source: https://github.com/schemaorg/schemaorg/issues/2564

DefinedTerm
type: Class
isPartOf: pending.schema.org
comment: A word, name, acronym, phrase, etc. with a formal definition. Often used in the context of category or subject classification, glossaries or dictionaries, product or creative work types, etc. Use the name property for the term being defined, use termCode if the term has an alpha-numeric code allocated, use description to provide the definition of the term. Use the about property to specify what the term is about.
subclass of: Intangible
source: https://github.com/schemaorg/schemaorg/issues/894

MediaEnumeration
type: Class
source: https://github.com/schemaorg/schemaorg/issues/3392
comment: MediaEnumeration enumerations are lists of codes, labels etc. useful for describing media objects. They may be reflections of externally developed lists, or created at schema.org, or a combination.
subclass of: Enumeration
isPartOf: pending.schema.org

Country
type: Class
subclass of: GeopoliticalEntity
subclass of: AdministrativeArea
equivalent class: Country
comment: A country.

MedicalIndication
type: Class
subclass of: MedicalEntity
comment: A condition or factor that indicates use of a medical therapy, including signs, symptoms, risk factors, anatomical states, etc.
isPartOf: health-lifesci.schema.org

dataset
type: Property
rangeIncludes: Dataset
comment: A dataset contained in this catalog.
inverseOf: includedInDataCatalog
domainIncludes: DataCatalog

TouristDestination
type: Class
subclass of: Place
contributor: Tourism
contributor: IIT-CNR.it
source: https://github.com/schemaorg/schemaorg/issues/1810
comment: A tourist destination. In principle any Place can be a TouristDestination from a City, Region or Country to an AmusementPark or Hotel. This Type can be used on its own to describe a general TouristDestination, or be used as an additionalType to add tourist relevant properties to any other Place. A TouristDestination is defined as a Place that contains, or is colocated with, one or more TouristAttractions, often linked by a similar theme or interest to a particular touristType. The [UNWTO](http://www2.unwto.org/) defines Destination (main destination of a tourism trip) as the place visited that is central to the decision to take the trip. (See examples below.)
isPartOf: pending.schema.org

superEvent
type: Property
domainIncludes: Event
rangeIncludes: Event
comment: An event that this event is a part of. For example, a collection of individual music performances might each have a music festival as their superEvent.
inverseOf: subEvent

InvestmentOrDeposit
type: Class
subclass of: FinancialProduct
comment: A type of financial product that typically requires the client to transfer funds to a financial service in return for potential beneficial financial return.
contributor: FIBO

MonetaryAmountDistribution
type: Class
source: https://github.com/schemaorg/schemaorg/issues/1698
subclass of: QuantitativeValueDistribution
comment: A statistical distribution of monetary amounts.

BusinessFunction
type: Class
contributor: good-relations-and-schema-org
comment: The business function specifies the type of activity or access (i.e., the bundle of rights) offered by the organization or business person through the offer. Typical are sell, rental or lease, maintenance or repair, manufacture / produce, recycle / dispose, engineering / construction, or installation. Proprietary specifications of access rights are also instances of this class.\n\nCommonly used values:\n\n* http://purl.org/goodrelations/v1#ConstructionInstallation\n* http://purl.org/goodrelations/v1#Dispose\n* http://purl.org/goodrelations/v1#LeaseOut\n* http://purl.org/goodrelations/v1#Maintain\n* http://purl.org/goodrelations/v1#ProvideService\n* http://purl.org/goodrelations/v1#Repair\n* http://purl.org/goodrelations/v1#Sell\n* http://purl.org/goodrelations/v1#Buy
subclass of: Enumeration

3DModel
type: Class
isPartOf: pending.schema.org
comment: A 3D model represents some kind of 3D content, which may have encodings in one or more MediaObjects. Many 3D formats are available (e.g. see [Wikipedia](https://en.wikipedia.org/wiki/Category:3D_graphics_file_formats)); specific encoding formats can be represented using the encodingFormat property applied to the relevant MediaObject. For the case of a single file published after Zip compression, the convention of appending '+zip' to the encodingFormat can be used. Geospatial, AR/VR, artistic/animation, gaming, engineering and scientific content can all be represented using 3DModel.
source: https://github.com/schemaorg/schemaorg/issues/2140
subclass of: MediaObject

AggregateOffer
type: Class
subclass of: Offer
comment: When a single product is associated with multiple offers (for example, the same pair of shoes is offered by different merchants), then AggregateOffer can be used.\n\nNote: AggregateOffers are normally expected to associate multiple offers that all share the same defined businessFunction value, or default to http://purl.org/goodrelations/v1#Sell if businessFunction is not explicitly defined.

Recommendation
type: Class
source: https://github.com/schemaorg/schemaorg/issues/2405
subclass of: Review
comment: Recommendation is a type of Review that suggests or proposes something as the best option or best course of action. Recommendations may be for products or services, or other concrete things, as in the case of a ranked list or product guide. A Guide may list multiple recommendations for different categories. For example, in a Guide about which TVs to buy, the author may have several Recommendations.
isPartOf: pending.schema.org

PerformanceRole
type: Class
subclass of: Role
comment: A PerformanceRole is a Role that some entity places with regard to a theatrical performance, e.g. in a Movie, TVSeries etc.

OnlineBusiness
type: Class
comment: A particular online business, either standalone or the online part of a broader organization. Examples include an eCommerce site, an online travel booking site, an online learning site, an online logistics and shipping provider, an online (virtual) doctor, etc.
source: https://github.com/schemaorg/schemaorg/issues/3028
subclass of: Organization
isPartOf: pending.schema.org

UpdateAction
type: Class
comment: The act of managing by changing/editing the state of the object.
subclass of: Action

CommunicateAction
type: Class
subclass of: InteractAction
comment: The act of conveying information to another person via a communication medium (instrument) such as speech, email, or telephone conversation.

PathologyTest
type: Class
subclass of: MedicalTest
isPartOf: health-lifesci.schema.org
comment: A medical test performed by a laboratory that typically involves examination of a tissue sample by a pathologist.

Occupation
type: Class
source: https://github.com/schemaorg/schemaorg/issues/1698
comment: A profession, may involve prolonged training and/or a formal qualification.
subclass of: Intangible

cause
type: Property
inverseOf: causeOf
isPartOf: health-lifesci.schema.org
domainIncludes: MedicalCondition
comment: The cause of a medical condition.
rangeIncludes: MedicalCause

causeOf
type: Property
inverseOf: cause
comment: The condition, complication, symptom, sign, etc. caused.
domainIncludes: MedicalCause
rangeIncludes: MedicalEntity
isPartOf: health-lifesci.schema.org

SizeSpecification
type: Class
comment: Size related properties of a product, typically a size code (name) and optionally a sizeSystem, sizeGroup, and product measurements (hasMeasurement). In addition, the intended audience can be defined through suggestedAge, suggestedGender, and suggested body measurements (suggestedMeasurement).
isPartOf: pending.schema.org
subclass of: QualitativeValue
source: https://github.com/schemaorg/schemaorg/issues/2811

PhysicalActivity
type: Class
isPartOf: health-lifesci.schema.org
subclass of: LifestyleModification
comment: Any bodily activity that enhances or maintains physical fitness and overall health and wellness. Includes activity that is part of daily living and routine, structured exercise, and exercise prescribed as part of a medical treatment or recovery plan.

AlignmentObject
type: Class
contributor: LRMIClass
comment: An intangible item that describes an alignment between a learning resource and a node in an educational framework. Should not be used where the nature of the alignment can be described using a simple property, for example to express that a resource teaches or assesses a competency.
subclass of: Intangible

PayAction
type: Class
subclass of: TradeAction
comment: An agent pays a price to a participant.

recordedAs
type: Property
domainIncludes: MusicComposition
contributor: MBZ
rangeIncludes: MusicRecording
inverseOf: recordingOf
comment: An audio recording of the work.

recordingOf
type: Property
inverseOf: recordedAs
comment: The composition this track is a recording of.
rangeIncludes: MusicComposition
domainIncludes: MusicRecording
contributor: MBZ

CivicStructure
type: Class
comment: A public structure, such as a town hall or concert hall.
subclass of: Place

WebSite
type: Class
comment: A WebSite is a set of related web pages and other items typically served from a single web domain and accessible via URLs.
subclass of: CreativeWork

Distance
type: Class
comment: Properties that take Distances as values are of the form '<Number> <Length unit of measure>'. E.g., '7 ft'.
subclass of: Quantity

RentalCarReservation
type: Class
subclass of: Reservation
comment: A reservation for a rental car.\n\nNote: This type is for information about actual reservations, e.g. in confirmation emails or HTML pages with individual confirmations of reservations.

MediaManipulationRatingEnumeration
type: Class
subclass of: Enumeration
isPartOf: pending.schema.org
source: https://github.com/schemaorg/schemaorg/issues/2450
comment: Codes for use with the mediaAuthenticityCategory property, indicating the authenticity of a media object (in the context of how it was published or shared). In general these codes are not mutually exclusive, although some combinations (such as 'original' versus 'transformed', 'edited' and 'staged') would be contradictory if applied in the same MediaReview. Note that the application of these codes is with regard to a piece of media shared or published in a particular context.

SendAction
type: Class
subclass of: TransferAction
comment: The act of physically/electronically dispatching an object for transfer from an origin to a destination. Related actions:\n\n* ReceiveAction: The reciprocal of SendAction.\n* GiveAction: Unlike GiveAction, SendAction does not imply the transfer of ownership (e.g. I can send you my laptop, but I'm not necessarily giving it to you).

OperatingSystem
type: Class
subclass of: SoftwareApplication
isPartOf: pending.schema.org
source: https://github.com/schemaorg/schemaorg/issues/4575
comment: System software that manages computer hardware and software resources, and provides common services for computer programs.

MedicalGuidelineRecommendation
type: Class
isPartOf: health-lifesci.schema.org
subclass of: MedicalGuideline
comment: A guideline recommendation that is regarded as efficacious and where quality of the data supporting the recommendation is sound.

MedicalStudyStatus
type: Class
comment: The status of a medical study. Enumerated type.
isPartOf: health-lifesci.schema.org
subclass of: MedicalEnumeration

ProgramMembership
type: Class
subclass of: Intangible
comment: Used to describe membership in a loyalty programs (e.g. "StarAliance"), traveler clubs (e.g. "AAA"), purchase clubs ("Safeway Club"), etc.

WebPage
type: Class
comment: A web page. Every web page is implicitly assumed to be declared to be of type WebPage, so the various properties about that webpage, such as breadcrumb may be used. We recommend explicit declaration if these properties are specified, but if they are found outside of an itemscope, they will be assumed to be about the page.
subclass of: CreativeWork

UnitPriceSpecification
type: Class
contributor: good-relations-and-schema-org
subclass of: PriceSpecification
comment: The price asked for a given offer by the respective organization or person.

HowToStep
type: Class
comment: A step in the instructions for how to achieve a result. It is an ordered list with HowToDirection and/or HowToTip items.
subclass of: CreativeWork
subclass of: ItemList
subclass of: ListItem

BodyMeasurementTypeEnumeration
type: Class
comment: Enumerates types (or dimensions) of a person's body measurements, for example for fitting of clothes.
source: https://github.com/schemaorg/schemaorg/issues/2811
isPartOf: pending.schema.org
subclass of: MeasurementTypeEnumeration

BioChemEntity
type: Class
comment: Any biological, chemical, or biochemical thing. For example: a protein; a gene; a chemical; a synthetic chemical.
isPartOf: pending.schema.org
source: bioschemas.org
subclass of: Thing

MedicalClinic
type: Class
subclass of: MedicalOrganization
subclass of: MedicalBusiness
comment: A facility, often associated with a hospital or medical school, that is devoted to the specific diagnosis and/or healthcare. Previously limited to outpatients but with evolution it may be open to inpatients as well.
isPartOf: health-lifesci.schema.org

NewsMediaOrganization
type: Class
isPartOf: pending.schema.org
comment: A News/Media organization such as a newspaper or TV station.
source: https://github.com/schemaorg/schemaorg/issues/1525
contributor: TP
subclass of: Organization

DatedMoneySpecification
type: Class
subclass of: StructuredValue
supersededBy: MonetaryAmount
comment: A DatedMoneySpecification represents monetary values with optional start and end dates. For example, this could represent an employee's salary over a specific period of time. __Note:__ This type has been superseded by MonetaryAmount, use of that type is recommended.

Blog
type: Class
subclass of: CreativeWork
comment: A [blog](https://en.wikipedia.org/wiki/Blog), sometimes known as a "weblog". Note that the individual posts (BlogPostings) in a Blog are often colloquially referred to by the same term.

ComicStory
type: Class
subclass of: CreativeWork
isPartOf: bib.schema.org
comment: The term "story" is any indivisible, re-printable unit of a comic, including the interior stories, covers, and backmatter. Most comics have at least two stories: a cover (ComicCoverArt) and an interior story.

Class
subclass of: Intangible
comment: A class, also often called a 'Type'; equivalent to rdfs:Class.
isPartOf: meta.schema.org
equivalent class: Class

BroadcastFrequencySpecification
type: Class
subclass of: Intangible
comment: The frequency in MHz and the modulation used for a particular BroadcastService.
source: https://github.com/schemaorg/schemaorg/issues/1004

Substance
type: Class
subclass of: MedicalEntity
comment: Any matter of defined composition that has discrete existence, whose origin may be biological, mineral or chemical.
isPartOf: health-lifesci.schema.org
equivalent class: http://purl.bioontology.org/ontology/SNOMEDCT/105590001

MedicalConditionStage
type: Class
isPartOf: health-lifesci.schema.org
subclass of: MedicalIntangible
comment: A stage of a medical condition, such as 'Stage IIIa'.

FulfillmentTypeEnumeration
type: Class
subclass of: Enumeration
isPartOf: pending.schema.org
comment: A type of product fulfillment.
source: https://github.com/schemaorg/schemaorg/issues/3617

BankAccount
type: Class
comment: A product or service offered by a bank whereby one may deposit, withdraw or transfer money and in some cases be paid interest.
equivalent class: BankAccount
contributor: FIBO
subclass of: FinancialProduct

NLNonprofitType
type: Class
isPartOf: pending.schema.org
comment: NLNonprofitType: Non-profit organization type originating from the Netherlands.
source: https://github.com/schemaorg/schemaorg/issues/2543
subclass of: NonprofitType

DriveWheelConfigurationValue
type: Class
comment: A value indicating which roadwheels will receive torque.
contributor: Automotive Ontology Working Group
subclass of: QualitativeValue

BusinessEntityType
type: Class
comment: A business entity type is a conceptual entity representing the legal form, the size, the main line of business, the position in the value chain, or any combination thereof, of an organization or business person.\n\nCommonly used values:\n\n* http://purl.org/goodrelations/v1#Business\n* http://purl.org/goodrelations/v1#Enduser\n* http://purl.org/goodrelations/v1#PublicInstitution\n* http://purl.org/goodrelations/v1#Reseller
subclass of: Enumeration
contributor: good-relations-and-schema-org

Time
type: Class
type: DataType
comment: A point in time recurring on multiple days in the form hh:mm:ss[Z|(+|-)hh:mm] (see [XML schema for details](http://www.w3.org/TR/xmlschema-2/#time)).

OfferShippingDetails
type: Class
subclass of: StructuredValue
comment: OfferShippingDetails represents information about shipping destinations. Multiple of these entities can be used to represent different shipping rates for different destinations: One entity for Alaska/Hawaii. A different one for continental US. A different one for all France. Multiple of these entities can be used to represent different shipping costs and delivery times. Two entities that are identical but differ in rate and time: E.g. Cheaper and slower: $5 in 5-7 days or Fast and expensive: $15 in 1-2 days.
source: https://github.com/schemaorg/schemaorg/issues/2506

OfferCatalog
type: Class
comment: An OfferCatalog is an ItemList that contains related Offers and/or further OfferCatalogs that are offeredBy the same provider.
subclass of: ItemList

ControlAction
type: Class
subclass of: Action
comment: An agent controls a device or application.

MediaGallery
type: Class
comment: Web page type: Media gallery page. A mixed-media page that can contain media such as images, videos, and other multimedia.
subclass of: CollectionPage

MapCategoryType
type: Class
subclass of: Enumeration
comment: An enumeration of several kinds of Map.

Periodical
type: Class
subclass of: CreativeWorkSeries
contributor: bibex
equivalent class: Periodical
comment: A publication in any medium issued in successive parts bearing numerical or chronological designations and intended to continue indefinitely, such as a magazine, scholarly journal, or newspaper.\n\nSee also [blog post](https://blog.schema.org/2014/09/02/schema-org-support-for-bibliographic-relationships-and-periodicals/).

ArchiveComponent
type: Class
comment: An intangible type to be applied to any archive content, carrying with it a set of properties required to describe archival items and collections.
source: https://github.com/schemaorg/schemaorg/issues/1758
subclass of: CreativeWork
isPartOf: pending.schema.org

DrugCostCategory
type: Class
isPartOf: health-lifesci.schema.org
subclass of: MedicalEnumeration
comment: Enumerated categories of medical drug costs.

DigitalDocument
type: Class
subclass of: CreativeWork
subclass of: Document
equivalent class: ElectronicDocument
comment: An electronic file or document.

CreditCard
type: Class
subclass of: LoanOrCredit
subclass of: PaymentCard
contributor: good-relations-and-schema-org
contributor: FIBO
comment: A card payment method of a particular brand or name. Used to mark up a particular payment method and/or the financial product/service that supplies the card account.\n\nCommonly used values:\n\n* http://purl.org/goodrelations/v1#AmericanExpress\n* http://purl.org/goodrelations/v1#DinersClub\n* http://purl.org/goodrelations/v1#Discover\n* http://purl.org/goodrelations/v1#JCB\n* http://purl.org/goodrelations/v1#MasterCard\n* http://purl.org/goodrelations/v1#VISA

Enumeration
type: Class
comment: Lists or enumerations—for example, a list of cuisines or music genres, etc.
subclass of: Intangible

VoteAction
type: Class
subclass of: ChooseAction
comment: The act of expressing a preference from a fixed/finite/structured set of choices/options.

SomeProducts
type: Class
comment: A placeholder for multiple similar products of the same kind.
subclass of: Product
contributor: good-relations-and-schema-org

RestrictedDiet
type: Class
subclass of: Enumeration
comment: A diet restricted to certain foods or preparations for cultural, religious, health or lifestyle reasons.

TherapeuticProcedure
type: Class
isPartOf: health-lifesci.schema.org
subclass of: MedicalProcedure
equivalent class: http://purl.bioontology.org/ontology/SNOMEDCT/277132007
comment: A medical procedure intended primarily for therapeutic purposes, aimed at improving a health condition.

SearchAction
type: Class
subclass of: Action
comment: The act of searching for an object.\n\nRelated actions:\n\n* FindAction: SearchAction generally leads to a FindAction, but not necessarily.

HowToDirection
type: Class
subclass of: CreativeWork
subclass of: ListItem
comment: A direction indicating a single action to do in the instructions for how to achieve a result.

ShippingService
type: Class
comment: ShippingService represents the criteria used to determine if and how an offer could be shipped to a customer.
isPartOf: pending.schema.org
source: https://github.com/schemaorg/schemaorg/issues/3617
subclass of: StructuredValue

game
type: Property
rangeIncludes: VideoGame
comment: Video game which is played on this server.
domainIncludes: GameServer
inverseOf: gameServer

gameServer
type: Property
inverseOf: game
domainIncludes: VideoGame
rangeIncludes: GameServer
comment: The server on which it is possible to play the game.

WearableSizeSystemEnumeration
type: Class
subclass of: SizeSystemEnumeration
source: https://github.com/schemaorg/schemaorg/issues/2811
isPartOf: pending.schema.org
comment: Enumerates common size systems specific for wearable products.

APIReference
type: Class
comment: Reference documentation for application programming interfaces (APIs).
subclass of: TechArticle

Text
type: Class
type: DataType
comment: Data type: Text.

Order
type: Class
subclass of: Intangible
subclass of: LegalDocument
equivalent class: Order
comment: An order is a confirmation of a transaction (a receipt), which can contain multiple line items, each represented by an Offer that has been accepted by the customer.

ShippingConditions
type: Class
comment: ShippingConditions represent a set of constraints and information about the conditions of shipping a product. Such conditions may apply to only a subset of the products being shipped, depending on aspects of the product like weight, size, price, destination, and others. All the specified conditions must be met for this ShippingConditions to apply.
isPartOf: pending.schema.org
subclass of: StructuredValue
source: https://github.com/schemaorg/schemaorg/issues/3617

GovernmentOffice
type: Class
comment: A government office—for example, an IRS or DMV office.
subclass of: LocalBusiness

MedicalAudience
type: Class
subclass of: Audience
subclass of: PeopleAudience
isPartOf: health-lifesci.schema.org
comment: Target audiences for medical web pages.

XPathType
type: Class
source: https://github.com/schemaorg/schemaorg/issues/1672
comment: Text representing an XPath (typically but not necessarily version 1.0).
isPartOf: pending.schema.org
subclass of: Text

MedicalCause
type: Class
comment: The causative agent(s) that are responsible for the pathophysiologic process that eventually results in a medical condition, symptom or sign. In this schema, unless otherwise specified this is meant to be the proximate cause of the medical condition, symptom or sign. The proximate cause is defined as the causative agent that most directly results in the medical condition, symptom or sign. For example, the HIV virus could be considered a cause of AIDS. Or in a diagnostic context, if a patient fell and sustained a hip fracture and two days later sustained a pulmonary embolism which eventuated in a cardiac arrest, the cause of the cardiac arrest (the proximate cause) would be the pulmonary embolism and not the fall. Medical causes can include cardiovascular, chemical, dermatologic, endocrine, environmental, gastroenterologic, genetic, hematologic, gynecologic, iatrogenic, infectious, musculoskeletal, neurologic, nutritional, obstetric, oncologic, otolaryngologic, pharmacologic, psychiatric, pulmonary, renal, rheumatologic, toxic, traumatic, or urologic causes; medical conditions can be causes as well.
isPartOf: health-lifesci.schema.org
subclass of: MedicalEntity

Number
type: Class
type: DataType
comment: Data type: Number.\n\nUsage guidelines:\n\n* Use values from 0123456789 (Unicode 'DIGIT ZERO' (U+0030) to 'DIGIT NINE' (U+0039)) rather than superficially similar Unicode symbols.\n* Use '.' (Unicode 'FULL STOP' (U+002E)) rather than ',' to indicate a decimal point. Avoid using these symbols as a readability separator.

OfferItemCondition
type: Class
subclass of: Enumeration
comment: A list of possible conditions for the item.

SellAction
type: Class
comment: The act of taking money from a buyer in exchange for goods or services rendered. An agent sells an object, product, or service to a buyer for a price. Reciprocal of BuyAction.
subclass of: TradeAction

mainEntity
type: Property
sub property of: about
comment: Indicates the primary entity described in some page or other CreativeWork.
domainIncludes: CreativeWork
inverseOf: mainEntityOfPage
rangeIncludes: Thing

mainEntityOfPage
type: Property
comment: Indicates a page (or other CreativeWork) for which this thing is the main entity being described. See [background notes](/docs/datamodel.html#mainEntityBackground) for details.
inverseOf: mainEntity
domainIncludes: Thing
rangeIncludes: CreativeWork
rangeIncludes: URL

Role
type: Class
subclass of: Intangible
comment: Represents additional information about a relationship or property. For example a Role can be used to say that a 'member' role linking some SportsTeam to a player occurred during a particular time period. Or that a Person's 'actor' role in a Movie was for some particular characterName. Such properties can be attached to a Role entity, which is then associated with the main entities using ordinary properties like 'member' or 'actor'.\n\nSee also [blog post](https://blog.schema.org/2014/06/16/introducing-role/).

PhysicalExam
type: Class
isPartOf: health-lifesci.schema.org
subclass of: MedicalEnumeration
subclass of: MedicalProcedure
comment: A type of physical examination of a patient performed by a physician.

MedicalSignOrSymptom
type: Class
comment: Any feature associated or not with a medical condition. In medicine a symptom is generally subjective while a sign is objective.
isPartOf: health-lifesci.schema.org
subclass of: MedicalCondition

Audience
type: Class
comment: Intended audience for an item, i.e. the group for whom the item was created.
subclass of: Intangible

RealEstateListing
type: Class
subclass of: WebPage
source: https://github.com/schemaorg/schemaorg/issues/2348
comment: A RealEstateListing is a listing that describes one or more real-estate Offers (whose businessFunction is typically to lease out, or to sell). The RealEstateListing type itself represents the overall listing, as manifested in some WebPage.
isPartOf: pending.schema.org

RecommendedDoseSchedule
type: Class
subclass of: DoseSchedule
isPartOf: health-lifesci.schema.org
comment: A recommended dosing schedule for a drug or supplement as prescribed or recommended by an authority or by the drug/supplement's manufacturer. Capture the recommending authority in the recognizingAuthority property of MedicalEntity.

Offer
type: Class
contributor: GoodRelationsTerms
equivalent class: Offer
subclass of: Intangible
comment: An offer to transfer some rights to an item or to provide a service — for example, an offer to sell tickets to an event, to rent the DVD of a movie, to stream a TV show over the internet, to repair a motorcycle, or to loan a book.\n\nNote: As the businessFunction property, which identifies the form of offer (e.g. sell, lease, repair, dispose), defaults to http://purl.org/goodrelations/v1#Sell; an Offer without a defined businessFunction value can be assumed to be an offer to sell.\n\nFor [GTIN](http://www.gs1.org/barcodes/technical/idkeys/gtin)-related fields, see [Check Digit calculator](http://www.gs1.org/barcodes/support/check_digit_calculator) and [validation guide](http://www.gs1us.org/resources/standards/gtin-validation-guide) from [GS1](http://www.gs1.org/).

ShippingDeliveryTime
type: Class
comment: ShippingDeliveryTime provides various pieces of information about delivery times for shipping.
subclass of: StructuredValue
source: https://github.com/schemaorg/schemaorg/issues/2506

MediaReviewItem
type: Class
source: https://github.com/schemaorg/schemaorg/issues/2450
subclass of: CreativeWork
isPartOf: pending.schema.org
comment: Represents an item or group of closely related items treated as a unit for the sake of evaluation in a MediaReview. Authorship etc. apply to the items rather than to the curation/grouping or reviewing party.

GameServer
type: Class
subclass of: Intangible
comment: Server that provides game interaction in a multiplayer game.

Movie
type: Class
subclass of: CreativeWork
comment: A movie.

EmployeeRole
type: Class
comment: A subclass of OrganizationRole used to describe employee relationships.
subclass of: OrganizationRole

DigitalDocumentPermission
type: Class
subclass of: Intangible
comment: A permission for a particular person or group to access a particular file.

SteeringPositionValue
type: Class
contributor: Automotive Ontology Working Group
comment: A value indicating a steering position.
subclass of: QualitativeValue

MeasurementTypeEnumeration
type: Class
source: https://github.com/schemaorg/schemaorg/issues/2811
subclass of: Enumeration
comment: Enumeration of common measurement types (or dimensions), for example "chest" for a person, "inseam" for pants, "gauge" for screws, or "wheel" for bicycles.
isPartOf: pending.schema.org

PronounceableText
type: Class
source: https://github.com/schemaorg/schemaorg/issues/2108
comment: Data type: PronounceableText.
isPartOf: pending.schema.org
subclass of: Text

Service
type: Class
comment: A service provided by an organization, e.g. delivery service, print services, etc.
subclass of: Intangible

Question
type: Class
subclass of: Comment
contributor: QAStackExchange
comment: A specific question - e.g. from a user seeking answers online, or collected in a Frequently Asked Questions (FAQ) document.

CssSelectorType
type: Class
comment: Text representing a CSS selector.
isPartOf: pending.schema.org
subclass of: Text
source: https://github.com/schemaorg/schemaorg/issues/1672

EUEnergyEfficiencyEnumeration
type: Class
subclass of: EnergyEfficiencyEnumeration
isPartOf: pending.schema.org
source: https://github.com/schemaorg/schemaorg/issues/2670
comment: Enumerates the EU energy efficiency classes A-G as well as A+, A++, and A+++ as defined in EU directive 2017/1369.

Claim
type: Class
source: https://github.com/schemaorg/schemaorg/issues/1828
subclass of: CreativeWork
isPartOf: pending.schema.org
comment: A Claim in Schema.org represents a specific, factually-oriented claim that could be the itemReviewed in a ClaimReview. The content of a claim can be summarized with the text property. Variations on well known claims can have their common identity indicated via sameAs links, and summarized with a name. Ideally, a Claim description includes enough contextual information to minimize the risk of ambiguity or inclarity. In practice, many claims are better understood in the context in which they appear or the interpretations provided by claim reviews. Beyond ClaimReview, the Claim type can be associated with related creative works - for example a ScholarlyArticle or Question might be about some Claim. At this time, Schema.org does not define any types of relationship between claims. This is a natural area for future exploration.

MedicalRiskEstimator
type: Class
comment: Any rule set or interactive tool for estimating the risk of developing a complication or condition.
isPartOf: health-lifesci.schema.org
subclass of: MedicalEntity

PropertyValueSpecification
type: Class
contributor: ActionCollabClass
comment: A Property value specification.
subclass of: Intangible

NewsArticle
type: Class
subclass of: Article
contributor: rNews
contributor: TP
comment: A NewsArticle is an article whose content reports news, or provides background context and supporting materials for understanding the news. A more detailed overview of [schema.org News markup](/docs/news.html) is also available.

Airport
type: Class
comment: An airport.
subclass of: CivicStructure

MonetaryAmount
type: Class
subclass of: StructuredValue
comment: A monetary value or range. This type can be used to describe an amount of money such as $50 USD, or a range as in describing a bank account being suitable for a balance between £1,000 and £1,000,000 GBP, or the value of a salary, etc. It is recommended to use PriceSpecification Types to describe the price of an Offer, Invoice, etc.
contributor: FIBO

MedicalTrialDesign
type: Class
isPartOf: health-lifesci.schema.org
subclass of: MedicalEnumeration
comment: Design models for medical trials. Enumerated type.
contributor: WikiDoc

InformAction
type: Class
comment: The act of notifying someone of information pertinent to them, with no expectation of a response.
subclass of: CommunicateAction

MedicalProcedureType
type: Class
comment: An enumeration that describes different types of medical procedures.
subclass of: MedicalEnumeration
isPartOf: health-lifesci.schema.org

UserComments
type: Class
subclass of: UserInteraction
comment: UserInteraction and its subtypes is an old way of talking about users interacting with pages. It is generally better to use Action-based vocabulary, alongside types such as Comment.
supersededBy: InteractionCounter
contributor: rNews

Energy
type: Class
subclass of: Quantity
comment: Properties that take Energy as values are of the form '<Number> <Energy unit of measure>'.

CommentAction
type: Class
subclass of: CommunicateAction
comment: The act of generating a comment about a subject.

PaymentChargeSpecification
type: Class
subclass of: PriceSpecification
comment: The costs of settling the payment using a particular payment method.
contributor: good-relations-and-schema-org

CategoryCodeSet
type: Class
comment: A set of Category Code values.
subclass of: DefinedTermSet
source: https://github.com/schemaorg/schemaorg/issues/894
isPartOf: pending.schema.org

BroadcastService
type: Class
comment: A delivery service through which content is provided via broadcast over the air or online.
subclass of: Service

MedicalRiskFactor
type: Class
isPartOf: health-lifesci.schema.org
comment: A risk factor is anything that increases a person's likelihood of developing or contracting a disease, medical condition, or complication.
subclass of: MedicalEntity

EndorseAction
type: Class
subclass of: ReactAction
comment: An agent approves/certifies/likes/supports/sanctions an object.

PaymentMethodType
type: Class
comment: The type of payment method, only for generic payment types, specific forms of payments, like card payment should be expressed using subclasses of PaymentMethod.
subclass of: Enumeration
source: https://github.com/schemaorg/schemaorg/issues/3537
isPartOf: pending.schema.org

EducationEvent
type: Class
comment: Event type: Education event.
subclass of: Event

CoverArt
type: Class
isPartOf: bib.schema.org
comment: The artwork on the outer surface of a CreativeWork.
subclass of: VisualArtwork

RsvpResponseType
type: Class
comment: RsvpResponseType is an enumeration type whose instances represent responding to an RSVP request.
subclass of: Enumeration

Language
type: Class
comment: Natural languages such as Spanish, Tamil, Hindi, English, etc. Formal language code tags expressed in [BCP 47](https://en.wikipedia.org/wiki/IETF_language_tag) can be used via the alternateName property. The Language type previously also covered programming languages such as Scheme and Lisp, which are now best represented using ComputerLanguage.
subclass of: Intangible

ListItem
type: Class
subclass of: Intangible
comment: An list item, e.g. a step in a checklist or how-to description.

FindAction
type: Class
comment: The act of finding an object.\n\nRelated actions:\n\n* SearchAction: FindAction is generally lead by a SearchAction, but not necessarily.
subclass of: Action

CookAction
type: Class
subclass of: CreateAction
comment: The act of producing/preparing food.

Vessel
type: Class
comment: A component of the human body circulatory system comprised of an intricate network of hollow tubes that transport blood throughout the entire body.
isPartOf: health-lifesci.schema.org
subclass of: AnatomicalStructure

JobPosting
type: Class
comment: A listing that describes a job opening in a certain organization.
subclass of: Intangible

MovieSeries
type: Class
comment: A series of movies. Included movies can be indicated with the hasPart property.
subclass of: CreativeWorkSeries

OrganizeAction
type: Class
subclass of: Action
comment: The act of manipulating/administering/supervising/controlling one or more objects.

ChemicalSubstance
type: Class
source: bioschemas.org
source: https://www.ebi.ac.uk/chebi/searchId.do
isPartOf: pending.schema.org
comment: A chemical substance is 'a portion of matter of constant composition, composed of molecular entities of the same type or of different types' (source: [ChEBI:59999](https://www.ebi.ac.uk/chebi/searchId.do?chebiId=59999)).
subclass of: BioChemEntity

MusicAlbum
type: Class
subclass of: MusicPlaylist
comment: A collection of music tracks.

ServiceChannel
type: Class
subclass of: Intangible
comment: A means for accessing a service, e.g. a government office location, web site, or phone number.

OnlineStore
type: Class
comment: An eCommerce site.
subclass of: OnlineBusiness
source: https://github.com/schemaorg/schemaorg/issues/3028
isPartOf: pending.schema.org

MedicalTest
type: Class
comment: Any medical test, typically performed for diagnostic purposes.
isPartOf: health-lifesci.schema.org
subclass of: MedicalEntity

ChooseAction
type: Class
subclass of: AssessAction
comment: The act of expressing a preference from a set of options or a large or unbounded set of choices/options.

FloorPlan
type: Class
source: https://github.com/schemaorg/schemaorg/issues/2373
subclass of: Intangible
isPartOf: pending.schema.org
comment: A FloorPlan is an explicit representation of a collection of similar accommodations, allowing the provision of common information (room counts, sizes, layout diagrams) and offers for rental or sale. In typical use, some ApartmentComplex has an accommodationFloorPlan which is a FloorPlan. A FloorPlan is always in the context of a particular place, either a larger ApartmentComplex or a single Apartment. The visual/spatial aspects of a floor plan (i.e. room layout, [see wikipedia](https://en.wikipedia.org/wiki/Floor_plan)) can be indicated using image.

HealthTopicContent
type: Class
source: https://github.com/schemaorg/schemaorg/issues/2374
subclass of: WebContent
comment: HealthTopicContent is WebContent that is about some aspect of a health topic, e.g. a condition, its symptoms or treatments. Such content may be comprised of several parts or sections and use different types of media. Multiple instances of WebContent (and hence HealthTopicContent) can be related using hasPart / isPartOf where there is some kind of content hierarchy, and their content described with about and mentions e.g. building upon the existing MedicalCondition vocabulary.
isPartOf: pending.schema.org

MedicalEntity
type: Class
isPartOf: health-lifesci.schema.org
comment: The most generic type of entity related to health and the practice of medicine.
subclass of: Thing

BankOrCreditUnion
type: Class
subclass of: FinancialService
comment: Bank or credit union.

HyperToc
type: Class
comment: A HyperToc represents a hypertext table of contents for complex media objects, such as VideoObject, AudioObject. Items in the table of contents are indicated using the tocEntry property, and typed HyperTocEntry. For cases where the same larger work is split into multiple files, associatedMedia can be used on individual HyperTocEntry items.
subclass of: CreativeWork
source: https://github.com/schemaorg/schemaorg/issues/2766
isPartOf: pending.schema.org

MusicGroup
type: Class
comment: A musical group, such as a band, an orchestra, or a choir. Can also be a solo musician.
subclass of: PerformingGroup

TaxiReservation
type: Class
subclass of: Reservation
comment: A reservation for a taxi.\n\nNote: This type is for information about actual reservations, e.g. in confirmation emails or HTML pages with individual confirmations of reservations. For offers of tickets, use Offer.

MedicalTrial
type: Class
subclass of: MedicalStudy
isPartOf: health-lifesci.schema.org
comment: A medical trial is a type of medical study that uses a scientific process to compare the safety and efficacy of medical therapies or medical procedures. In general, medical trials are controlled and subjects are allocated at random to the different treatment and/or control groups.

PerformAction
type: Class
subclass of: PlayAction
comment: The act of participating in performance arts.

Integer
type: Class
comment: Data type: Integer.
subclass of: Number

FlightReservation
type: Class
subclass of: Reservation
comment: A reservation for air travel.\n\nNote: This type is for information about actual reservations, e.g. in confirmation emails or HTML pages with individual confirmations of reservations. For offers of tickets, use Offer.

Date
type: Class
type: DataType
equivalent class: Date
comment: A date value in [ISO 8601 date format](http://en.wikipedia.org/wiki/ISO_8601).

Audiobook
type: Class
isPartOf: bib.schema.org
subclass of: AudioObject
subclass of: Book
comment: An audiobook.

ComputerLanguage
type: Class
comment: This type covers computer programming languages such as Scheme and Lisp, as well as other language-like computer representations. Natural languages are best represented with the Language type.
subclass of: Intangible

AuthorizeAction
type: Class
subclass of: AllocateAction
comment: The act of granting permission to an object.

RuntimePlatform
type: Class
source: https://github.com/schemaorg/schemaorg/issues/4575
subclass of: SoftwareApplication
isPartOf: pending.schema.org
comment: Specialized software environment that provides the essential infrastructure, libraries, and services required to execute a program.

RentAction
type: Class
subclass of: TradeAction
comment: The act of giving money in return for temporary use, but not ownership, of an object such as a vehicle or property. For example, an agent rents a property from a landlord in exchange for a periodic payment.

Menu
type: Class
comment: A structured representation of food or drink items available from a FoodEstablishment.
subclass of: CreativeWork

Action
type: Class
contributor: ActionCollabClass
comment: An action performed by a direct agent and indirect participants upon a direct object. Optionally happens at a location with the help of an inanimate instrument. The execution of the action may produce a result. Specific action sub-type documentation specifies the exact expectation of each argument/role.\n\nSee also [blog post](https://blog.schema.org/2014/04/16/announcing-schema-org-actions/) and [Actions overview document](http://schema.org/docs/actions.html).
subclass of: Thing

DrugPregnancyCategory
type: Class
comment: Categories that represent an assessment of the risk of fetal injury due to a drug or pharmaceutical used as directed by the mother during pregnancy.
isPartOf: health-lifesci.schema.org
subclass of: MedicalEnumeration

EnergyConsumptionDetails
type: Class
comment: EnergyConsumptionDetails represents information related to the energy efficiency of a product that consumes energy. The information that can be provided is based on international regulations such as for example [EU directive 2017/1369](https://eur-lex.europa.eu/eli/reg/2017/1369/oj) for energy labeling and the [Energy labeling rule](https://www.ftc.gov/enforcement/rules/rulemaking-regulatory-reform-proceedings/energy-water-use-labeling-consumer) under the Energy Policy and Conservation Act (EPCA) in the US.
subclass of: Intangible
isPartOf: pending.schema.org
source: https://github.com/schemaorg/schemaorg/issues/2670

contentLocation
type: Property
rangeIncludes: Place
domainIncludes: CreativeWork
comment: The location depicted or described in the content. For example, the location in a photograph or painting.

Suite
type: Class
subclass of: Accommodation
comment: A suite in a hotel or other public accommodation, denotes a class of luxury accommodations, the key feature of which is multiple rooms (source: Wikipedia, the free encyclopedia, see http://en.wikipedia.org/wiki/Suite_(hotel)). See also the dedicated document on the use of schema.org for marking up hotels and other forms of accommodations.
contributor: STI Accommodation Ontology

GamePlayMode
type: Class
comment: Indicates whether this game is multi-player, co-op or single-player.
subclass of: Enumeration

PriceSpecification
type: Class
comment: A structured value representing a price or price range. Typically, only the subclasses of this type are used for markup. It is recommended to use MonetaryAmount to describe independent amounts of money such as a salary, credit card limits, etc.
contributor: good-relations-and-schema-org
subclass of: StructuredValue
equivalent class: Price

BookFormatType
type: Class
comment: The publication format of the book.
subclass of: Enumeration

Clip
type: Class
comment: A short TV or radio program or a segment/part of a program.
subclass of: CreativeWork

FollowAction
type: Class
subclass of: InteractAction
comment: The act of forming a personal connection with someone/something (object) unidirectionally/asymmetrically to get updates polled from.\n\nRelated actions:\n\n* BefriendAction: Unlike BefriendAction, FollowAction implies that the connection is *not* necessarily reciprocal.\n* SubscribeAction: Unlike SubscribeAction, FollowAction implies that the follower acts as an active agent constantly/actively polling for updates.\n* RegisterAction: Unlike RegisterAction, FollowAction implies that the agent is interested in continuing receiving updates from the object.\n* JoinAction: Unlike JoinAction, FollowAction implies that the agent is interested in getting updates from the object.\n* TrackAction: Unlike TrackAction, FollowAction refers to the polling of updates of all aspects of animate objects rather than the location of inanimate objects (e.g. you track a package, but you don't follow it).

NonprofitType
type: Class
source: https://github.com/schemaorg/schemaorg/issues/2543
subclass of: Enumeration
comment: NonprofitType enumerates several kinds of official non-profit types of which a non-profit organization can be.
isPartOf: pending.schema.org

DigitalDocumentPermissionType
type: Class
comment: A type of permission which can be granted for accessing a digital document.
subclass of: Enumeration

MedicalStudy
type: Class
isPartOf: health-lifesci.schema.org
comment: A medical study is an umbrella type covering all kinds of research studies relating to human medicine or health, including observational studies and interventional trials and registries, randomized, controlled or not. When the specific type of study is known, use one of the extensions of this type, such as MedicalTrial or MedicalObservationalStudy. Also, note that this type should be used to mark up data that describes the study itself; to tag an article that publishes the results of a study, use MedicalScholarlyArticle. Note: use the code property of MedicalEntity to store study IDs, e.g. clinicaltrials.gov ID.
subclass of: MedicalEntity

Event
type: Class
comment: An event happening at a certain time and location, such as a concert, lecture, or festival. Ticketing information may be added via the offers property. Repeated events may be structured as separate Event objects.
subclass of: Thing
equivalent class: Event
equivalent class: Occurrence

LocalBusiness
type: Class
subclass of: Place
subclass of: Organization
comment: A particular physical business or branch of an organization. Examples of LocalBusiness include a restaurant, a particular branch of a restaurant chain, a branch of a bank, a medical practice, a club, a bowling alley, etc.

FoodEvent
type: Class
subclass of: Event
comment: Event type: Food event.

MedicalTestPanel
type: Class
subclass of: MedicalTest
comment: Any collection of tests commonly ordered together.
isPartOf: health-lifesci.schema.org

MedicalGuideline
type: Class
comment: Any recommendation made by a standard society (e.g. ACC/AHA) or consensus statement that denotes how to diagnose and treat a particular condition. Note: this type should be used to tag the actual guideline recommendation; if the guideline recommendation occurs in a larger scholarly article, use MedicalScholarlyArticle to tag the overall article, not this type. Note also: the organization making the recommendation should be captured in the recognizingAuthority base property of MedicalEntity.
isPartOf: health-lifesci.schema.org
subclass of: MedicalEntity

LearningResource
type: Class
subclass of: CreativeWork
source: https://github.com/schemaorg/schemaorg/issues/1401
isPartOf: pending.schema.org
comment: The LearningResource type can be used to indicate CreativeWorks (whether physical or digital) that have a particular and explicit orientation towards learning, education, skill acquisition, and other educational purposes. LearningResource is expected to be used as an addition to a primary type such as Book, VideoObject, Product etc. EducationEvent serves a similar purpose for event-like things (e.g. a Trip). A LearningResource may be created as a result of an EducationEvent, for example by recording one.

Recipe
type: Class
subclass of: HowTo
comment: A recipe. For dietary restrictions covered by the recipe, a few common restrictions are enumerated via suitableForDiet. The keywords property can also be used to add more detail.

NutritionInformation
type: Class
subclass of: StructuredValue
comment: Nutritional information about the recipe.

ReceiveAction
type: Class
subclass of: TransferAction
comment: The act of physically/electronically taking delivery of an object that has been transferred from an origin to a destination. Reciprocal of SendAction.\n\nRelated actions:\n\n* SendAction: The reciprocal of ReceiveAction.\n* TakeAction: Unlike TakeAction, ReceiveAction does not imply that the ownership has been transferred (e.g. I can receive a package, but it does not mean the package is now mine).

MusicRecording
type: Class
comment: A music recording (track), usually a single song.
subclass of: CreativeWork

Seat
type: Class
subclass of: Intangible
comment: Used to describe a seat, such as a reserved seat in an event reservation.

Series
type: Class
comment: A Series in schema.org is a group of related items, typically but not necessarily of the same kind. See also CreativeWorkSeries, EventSeries.
subclass of: Intangible

EventStatusType
type: Class
subclass of: StatusEnumeration
comment: EventStatusType is an enumeration type whose instances represent several states that an Event may be in.

MedicalOrganization
type: Class
subclass of: Organization
comment: A medical organization (physical or not), such as hospital, institution or clinic.

Hospital
type: Class
subclass of: CivicStructure
subclass of: EmergencyService
subclass of: MedicalOrganization
comment: A hospital.

Intangible
type: Class
subclass of: Thing
comment: A utility class that serves as the umbrella for a number of 'intangible' things such as quantities, structured values, etc.

CourseInstance
type: Class
subclass of: Event
comment: An instance of a Course which is distinct from other instances because it is offered at a different time or location or through different media or modes of study or to a specific section of students.

EntryPoint
type: Class
contributor: ActionCollabClass
comment: An entry point, within some Web-based protocol.
subclass of: Intangible

ImageObject
type: Class
comment: An image file.
subclass of: MediaObject
equivalent class: Image

MerchantReturnPolicy
type: Class
subclass of: Intangible
isPartOf: pending.schema.org
comment: A MerchantReturnPolicy provides information about product return policies associated with an Organization, Product, or Offer.
source: https://github.com/schemaorg/schemaorg/issues/2288

TradeAction
type: Class
subclass of: Action
comment: The act of participating in an exchange of goods and services for monetary compensation. An agent trades an object, product or service with a participant in exchange for a one time or periodic payment.

InteractionCounter
type: Class
comment: A summary of how users have interacted with this CreativeWork. In most cases, authors will use a subtype to specify the specific type of interaction.
subclass of: StructuredValue

GeoCircle
type: Class
comment: A GeoCircle is a GeoShape representing a circular geographic area. As it is a GeoShape it provides the simple textual property 'circle', but also allows the combination of postalCode alongside geoRadius. The center of the circle can be indicated via the 'geoMidpoint' property, or more approximately using 'address', 'postalCode'.
subclass of: GeoShape

WriteAction
type: Class
subclass of: CreateAction
comment: The act of authoring written creative content.

Chapter
type: Class
subclass of: CreativeWork
isPartOf: bib.schema.org
comment: One of the sections into which a book is divided. A chapter usually has a section number or a name.

MedicalSpecialty
type: Class
subclass of: Specialty
subclass of: MedicalEnumeration
comment: Any specific branch of medical science or practice. Medical specialities include clinical specialties that pertain to particular organ systems and their respective disease states, as well as allied health specialties. Enumerated type.
isPartOf: health-lifesci.schema.org

DeliveryEvent
type: Class
subclass of: Event
comment: An event involving the delivery of an item.

VisualArtwork
type: Class
subclass of: CreativeWork
comment: A work of art that is primarily visual in character.

LoseAction
type: Class
subclass of: AchieveAction
comment: The act of being defeated in a competitive activity.

SocialMediaPosting
type: Class
subclass of: Article
comment: A post to a social media platform, including blog posts, tweets, Facebook posts, etc.

PlanAction
type: Class
subclass of: OrganizeAction
comment: The act of planning the execution of an event/task/action/reservation/plan to a future date.

AdministrativeArea
type: Class
equivalent class: Subdivision
comment: A geographical region, typically under the jurisdiction of a particular government.
subclass of: Place

StatusEnumeration
type: Class
comment: Lists or enumerations dealing with status types.
subclass of: Enumeration
source: https://github.com/schemaorg/schemaorg/issues/2604

TVSeason
type: Class
subclass of: CreativeWorkSeason
subclass of: CreativeWork
comment: Season dedicated to TV broadcast and associated online delivery.

BedDetails
type: Class
contributor: STI Accommodation Ontology
subclass of: Intangible
comment: An entity holding detailed information about the available bed types, e.g. the quantity of twin beds for a hotel room. For the single case of just one bed of a certain type, you can use bed directly with a text. See also BedType (under development).

Thesis
type: Class
comment: A thesis or dissertation document submitted in support of candidature for an academic degree or professional qualification.
subclass of: CreativeWork
isPartOf: bib.schema.org
source: Thesis

AudioObject
type: Class
subclass of: MediaObject
contributor: rNews
comment: An audio file.

MusicRelease
type: Class
subclass of: MusicPlaylist
contributor: MBZ
comment: A MusicRelease is a specific release of a music album.

StatisticalPopulation
type: Class
subclass of: Intangible
comment: A StatisticalPopulation is a set of instances of a certain given type that satisfy some set of constraints. The property populationType is used to specify the type. Any property that can be used on instances of that type can appear on the statistical population. For example, a StatisticalPopulation representing all Persons with a homeLocation of East Podunk California would be described by applying the appropriate homeLocation and populationType properties to a StatisticalPopulation item that stands for that set of people. The properties numConstraints and constraintProperty are used to specify which of the populations properties are used to specify the population. Note that the sense of "population" used here is the general sense of a statistical population, and does not imply that the population consists of people. For example, a populationType of Event or NewsArticle could be used. See also Observation, where a populationType such as Person or Event can be indicated directly. In most cases it may be better to use StatisticalVariable instead of StatisticalPopulation.
source: https://github.com/schemaorg/schemaorg/issues/2291
isPartOf: pending.schema.org

Grant
type: Class
subclass of: Intangible
source: FundInfoCollab
source: https://github.com/schemaorg/schemaorg/issues/383
comment: A grant, typically financial or otherwise quantifiable, of resources. Typically a funder sponsors some MonetaryAmount to an Organization or Person, sometimes not necessarily via a dedicated or long-lived Project, resulting in one or more outputs, or fundedItems. For financial sponsorship, indicate the funder of a MonetaryGrant. For non-financial support, indicate sponsor of Grants of resources (e.g. office space). Grants support activities directed towards some agreed collective goals, often but not always organized as Projects. Long-lived projects are sometimes sponsored by a variety of grants over time, but it is also common for a project to be associated with a single grant. The amount of a Grant is represented using amount as a MonetaryAmount.
isPartOf: pending.schema.org

LodgingBusiness
type: Class
subclass of: LocalBusiness
comment: A lodging business, such as a motel, hotel, or inn.

DataDownload
type: Class
comment: All or part of a Dataset in downloadable form.
contributor: DatasetClass
equivalent class: Distribution
subclass of: MediaObject

ReturnAction
type: Class
subclass of: TransferAction
comment: The act of returning to the origin that which was previously received (concrete objects) or taken (ownership).

BorrowAction
type: Class
subclass of: TransferAction
comment: The act of obtaining an object under an agreement to return it at a later date. Reciprocal of LendAction.\n\nRelated actions:\n\n* LendAction: Reciprocal of BorrowAction.

InfectiousAgentClass
type: Class
isPartOf: health-lifesci.schema.org
subclass of: MedicalEnumeration
comment: Classes of agents or pathogens that transmit infectious diseases. Enumerated type.

ParentAudience
type: Class
comment: A set of characteristics describing parents, who can be interested in viewing some content.
subclass of: PeopleAudience

SpeakableSpecification
type: Class
subclass of: Intangible
comment: A SpeakableSpecification indicates (typically via xpath or cssSelector) sections of a document that are highlighted as particularly speakable. Instances of this type are expected to be used primarily as values of the speakable property.
source: https://github.com/schemaorg/schemaorg/issues/1389

PeopleAudience
type: Class
subclass of: Audience
comment: A set of characteristics belonging to people, e.g. who compose an item's target audience.

HowToSupply
type: Class
comment: A supply consumed when performing the instructions for how to achieve a result.
subclass of: HowToItem

Airline
type: Class
comment: An organization that provides flights for passengers.
subclass of: Organization

MobileApplication
type: Class
comment: A software application designed specifically to work well on a mobile device such as a telephone.
subclass of: SoftwareApplication

UseAction
type: Class
subclass of: ConsumeAction
comment: The act of applying an object to its intended purpose.