OWL-Time
type: Ontology
version IRI: http://www.w3.org/2006/time#2016
contributor: https://orcid.org/0000-0001-8269-8171
created: 2006-09-27
creator: http://orcid.org/0000-0002-3884-3420
creator: Jerry Hobbs
is version of: owl-time
license: https://creativecommons.org/licenses/by/4.0/
modified: 2017-04-06
rights: Copyright © 2006-2017 W3C, OGC. W3C and OGC liability, trademark and document use rules apply.
label: Tiempo en OWL @es
prior version: http://www.w3.org/2006/time#2006
change note: 2016-06-15 - initial update of OWL-Time - modified to support arbitrary temporal reference systems.
change note: 2016-12-20 - adjust range of time:timeZone to time:TimeZone, moved up from the tzont ontology.
change note: 2016-12-20 - restore time:Year and time:January which were present in the 2006 version of the ontology, but now marked "deprecated".
change note: 2017-02 - intervalIn, intervalDisjoint, monthOfYear added; TemporalUnit subclass of TemporalDuration
change note: 2017-04-06 - hasTime, hasXSDDuration added; Number removed; all duration elements changed to xsd:decimal
history note: Update of OWL-Time ontology, extended to support general temporal reference systems. Ontology engineering by Simon J D Cox

Generalized day
type: Datatype
comment: Day of month - formulated as a text string with a pattern constraint to reproduce the same lexical form as gDay, except that values up to 99 are permitted, in order to support calendars with more than 31 days in a month. Note that the value-space is not defined, so a generic OWL2 processor cannot compute ordering relationships of values of this type.
comment: Día del mes - formulado como una cadena de texto con una restricción patrón para reproducir la misma forma léxica que gDay, excepto que se permiten valores hasta el 99, con el propósito de proporcionar soporte a calendarios con meses con más de 31 días. Nótese que el espacio de valores no está definido, por tanto, un procesador genérico de OWL2 no puede computar relaciones de orden de valores de este tipo. @es
label: Día generalizado @es

Generalized month
type: Datatype
comment: Mes del año - formulado como una cadena de texto con una restricción patrón para reproducir la misma forma léxica que gMonth, excepto que se permiten valores hasta el 20, con el propósito de proporcionar soporte a calendarios con años con más de 12 meses. Nótese que el espacio de valores no está definido, por tanto, un procesador genérico de OWL2 no puede computar relaciones de orden de valores de este tipo. @es
comment: Month of year - formulated as a text string with a pattern constraint to reproduce the same lexical form as gMonth, except that values up to 20 are permitted, in order to support calendars with more than 12 months in the year. Note that the value-space is not defined, so a generic OWL2 processor cannot compute ordering relationships of values of this type.
label: Mes generalizado @es

Generalized year
type: Datatype
comment: Número de año - formulado como una cadena de texto con una restricción patrón para reproducir la misma forma léxica que gYear, aunque no está restringido a valores del calendario gregoriano. Nótese que el espacio de valores no está definido, por tanto, un procesador genérico de OWL2 no puede computar relaciones de orden de valores de este tipo. @es
comment: Year number - formulated as a text string with a pattern constraint to reproduce the same lexical form as gYear, but not restricted to values from the Gregorian calendar. Note that the value-space is not defined, so a generic OWL2 processor cannot compute ordering relationships of values of this type.
label: Año generalizado @es

after
type: ObjectProperty
inverse of: before
domain: Temporal entity
range: Temporal entity
comment: Asume una dirección en el tiempo. Si una entidad temporal T1 está después de otra entidad temporal T2, entonces el principio de T1 está después del final de T2. @es
comment: Gives directionality to time. If a temporal entity T1 is after another temporal entity T2, then the beginning of T1 is after the end of T2.
label: después @es

before
type: ObjectProperty
type: TransitiveProperty
domain: Temporal entity
range: Temporal entity
comment: Asume una dirección en el tiempo. Si una entidad temporal T1 está antes que otra entidad temporal T2, entonces el final de T1 está antes que el principio de T2. Así, "antes" se puede considerar básica para instantes y derivada para intervalos. @es
comment: Gives directionality to time. If a temporal entity T1 is before another temporal entity T2, then the end of T1 is before the beginning of T2. Thus, "before" can be considered to be basic to instants and derived for intervals.
label: antes @es

day of week
type: ObjectProperty
domain: Generalized date-time description
range: Day of week
comment: The day of week, whose value is a member of the class time:DayOfWeek
comment: El día de la semana, cuyo valor es un miembro de la clase 'día de la semana'.
label: día de la semana @es

has beginning
type: ObjectProperty
sub property of: has time
domain: Temporal entity
range: Time instant
comment: Beginning of a temporal entity
comment: Comienzo de una entidad temporal. @es
label: tiene principio @es
definition: Beginning of a temporal entity.

has Date-Time description
type: ObjectProperty
domain: Date-time interval
range: Generalized date-time description
comment: Valor de intervalo de fecha-hora expresado como un valor estructurado. El principio y el final del intervalo coincide con los límites del elemento más corto en la descripción. @es
comment: Value of DateTimeInterval expressed as a structured value. The beginning and end of the interval coincide with the limits of the shortest element in the description.
label: tiene descripción fecha-hora @es

has duration
type: ObjectProperty
sub property of: has temporal duration
range: duración de tiempo
comment: Duración de una entidad temporal, expresada como un valor escalado o un valor nominal. @es
comment: Duration of a temporal entity, expressed as a scaled value or nominal value
label: tiene duración @es
definition: Duración de una entidad temporal, evento o actividad, o cosa, expresada como un valor escalado. @es
definition: Duration of a temporal entity, event or activity, or thing, expressed as a scaled value

has duration description
type: ObjectProperty
sub property of: has temporal duration
range: Generalized duration description
comment: Duración de una entidad temporal, expresada utilizando una descripción estructurada. @es
comment: Duration of a temporal entity, expressed using a structured description
label: tiene descripción de duración @es

has end
type: ObjectProperty
sub property of: has time
domain: Temporal entity
range: Time instant
comment: End of a temporal entity.
comment: Final de una entidad temporal. @es
label: tiene fin @es

Temporal reference system used
type: ObjectProperty
type: FunctionalProperty
domain: Class
  union of: Generalized duration description
  union of: Temporal position
range: Temporal Reference System
comment: El sistema de referencia temporal utilizado por una posición temporal o descripción de extensión. @es
comment: The temporal reference system used by a temporal position or extent description.
label: sistema de referencia temporal utilizado @es

has temporal duration
type: ObjectProperty
domain: Temporal entity
range: Temporal duration
comment: Duración de una entidad temporal. @es
comment: Duration of a temporal entity.
label: tiene duración temporal @es

has time
type: ObjectProperty
range: Temporal entity
comment: Proporciona soporte a la asociación de una entidad temporal (instante o intervalo) a cualquier cosa. @es
comment: Supports the association of a temporal entity (instant or interval) to any thing
label: tiene tiempo @es
editorial note: Característica arriesgada -añadida en la revisión del 2017 que no ha sido todavía utilizada de forma amplia. @es
editorial note: Feature at risk - added in 2017 revision, and not yet widely used.

in date-time description
type: ObjectProperty
sub property of: Temporal position
domain: Time instant
range: Generalized date-time description
comment: Posición de un instante, expresada utilizando una descripción estructurada. @es
comment: Position of an instant, expressed using a structured description
label: en descripción de fecha-hora @es

Temporal position
type: ObjectProperty
domain: Time instant
range: Temporal position
comment: Posición de un instante de tiempo. @es
comment: Position of a time instant
label: posición temporal @es

Time position
type: ObjectProperty
sub property of: Temporal position
domain: Time instant
range: Time position
comment: Posición de un instante, expresada como una coordenada temporal o un valor nominal. @es
comment: Position of an instant, expressed as a temporal coordinate or nominal value
label: posición de tiempo @es
definition: Position of a time instant expressed as a TimePosition

has time instant inside
type: ObjectProperty
domain: Time interval
range: Time instant
comment: An instant that falls inside the interval. It is not intended to include beginnings and ends of intervals.
comment: Un instante que cae dentro del intervalo. Se asume que no es ni el principio ni el final de ningún intervalo. @es
label: tiene instante de tiempo dentro @es

interval after
type: ObjectProperty
sub property of: after
sub property of: interval disjoint
inverse of: interval before
domain: Proper interval
range: Proper interval
comment: If a proper interval T1 is intervalAfter another proper interval T2, then the beginning of T1 is after the end of T2.
comment: Si un intervalo propio T1 es posterior a otro intervalo propio T2, entonces el principio de T1 está después que el final de T2.
label: intervalo posterior @es

interval before
type: ObjectProperty
sub property of: before
sub property of: interval disjoint
domain: Proper interval
range: Proper interval
comment: If a proper interval T1 is intervalBefore another proper interval T2, then the end of T1 is before the beginning of T2.
comment: Si un intervalo propio T1 está antes que otro intervalo propio T2, entonces el final de T1 está antes que el principio de T2. @es
label: intervalo anterior @es

interval contains
type: ObjectProperty
inverse of: interval during
domain: Proper interval
range: Proper interval
comment: If a proper interval T1 is intervalContains another proper interval T2, then the beginning of T1 is before the beginning of T2, and the end of T1 is after the end of T2.
comment: Si un intervalo propio T1 contiene otro intervalo propio T2, entonces el principio de T1 está antes que el principio de T2, y el final de T1 está después del final de T2. @es
label: intervalo contiene @es

interval disjoint
type: ObjectProperty
domain: Proper interval
range: Proper interval
comment: If a proper interval T1 is intervalDisjoint another proper interval T2, then the beginning of T1 is after the end of T2, or the end of T1 is before the beginning of T2, i.e. the intervals do not overlap in any way, but their ordering relationship is not known.
comment: Si un intervalo propio T1 es disjunto con otro intervalo propio T2, entonces el principio de T1 está después del final de T2, o el final de T1 está antes que el principio de T2, es decir, los intervalos no se solapan de ninguna forma, aunque su relación de orden no se conozca. @es
label: intervalo disjunto @es
note: Esta relación entre intervalos no estaba incluida en las 13 relaciones básicas definidas por Allen (1984), pero está definida en T.3 como la unión de 'intervalo anterior' con 'intervalo posterior'. Sin embargo, esto está fuera de la expresividad de OWL2, por tanto, está implementado como una propiedad explícita, con 'intervalo anterior' e 'intervalo posterior' como sub-propiedades. @es
note: This interval relation is not included in the 13 basic relationships defined in Allen (1984), but is defined in (T.3) as the union of :intervalBefore v :intervalAfter . However, that is outside OWL2 expressivity, so is implemented as an explicit property, with :intervalBefore , :intervalAfter as sub-properties

interval during
type: ObjectProperty
sub property of: interval in
domain: Proper interval
range: Proper interval
comment: If a proper interval T1 is intervalDuring another proper interval T2, then the beginning of T1 is after the beginning of T2, and the end of T1 is before the end of T2.
comment: Si un intervalo propio T1 está durante otro intervalo propio T2, entonces del principio de T1 está después del principio de T2, y el final de T1 está antes que el final de T2. @es
label: intervalo durante @es

interval equals
type: ObjectProperty
domain: Proper interval
range: Proper interval
property disjoint with: interval in
comment: If a proper interval T1 is intervalEquals another proper interval T2, then the beginning of T1 is coincident with the beginning of T2, and the end of T1 is coincident with the end of T2.
comment: Si un intervalo propio T1 es igual a otro intervalo propio T2, entonces el principio de T1 coincide con el principio de T2, y el final de T1 coincide con el final de T2. @es
label: intervalo igual @es

interval finished by
type: ObjectProperty
inverse of: interval finishes
domain: Proper interval
range: Proper interval
comment: If a proper interval T1 is intervalFinishedBy another proper interval T2, then the beginning of T1 is before the beginning of T2, and the end of T1 is coincident with the end of T2.
comment: Si un intervalo propio T1 está terminado por otro intervalo propio T2, entonces el principio de T1 está antes que el principio de T2, y el final de T1 coincide con el final de T2. @es
label: intervalo terminado por @es

interval finishes
type: ObjectProperty
sub property of: interval in
domain: Proper interval
range: Proper interval
comment: If a proper interval T1 is intervalFinishes another proper interval T2, then the beginning of T1 is after the beginning of T2, and the end of T1 is coincident with the end of T2.
comment: Si un intervalo propio T1 termina otro intervalo propio T2, entonces del principio de T1 está después del principio de T2, y el final de T1 coincide con el final de T2. @es
label: intervalo termina @es

interval in
type: ObjectProperty
domain: Proper interval
range: Proper interval
comment: If a proper interval T1 is intervalIn another proper interval T2, then the beginning of T1 is after the beginning of T2 or is coincident with the beginning of T2, and the end of T1 is before the end of T2, or is coincident with the end of T2, except that end of T1 may not be coincident with the end of T2 if the beginning of T1 is coincident with the beginning of T2.
comment: Si un intervalo propio T1 es un intervalo interior a otro intervalo propio T2, entonces el principio de T1 está después del principio de T2 o coincide con el principio de T2, y el final de T1 está antes que el final de T2, o coincide con el final de T2, excepto que el final de T1 puede no coincidir con el final de T2 si el principio de T1 coincide con el principio de T2. @es
label: intervalo interior @es
note: Esta relación entre intervalos no estaba incluida en las 13 relaciones básicas definidas por Allen (1984), pero se hace referencia a ella como "una relación importante" en Allen y Ferguson (1997). Es la unión disjunta de 'intervalo empieza', 'intervalo durante' y con 'intervalo termina'. Sin embargo, esto está fuera de la expresividad de OWL2, por tanto, se implementa como una propiedad explícita, con 'intervalo empieza', 'intervalo durante' e 'intervalo termina' como sub-propiedades. @es
note: This interval relation is not included in the 13 basic relationships defined in Allen (1984), but is referred to as 'an important relationship' in Allen and Ferguson (1997). It is the disjoint union of :intervalStarts v :intervalDuring v :intervalFinishes . However, that is outside OWL2 expressivity, so is implemented as an explicit property, with :intervalStarts , :intervalDuring , :intervalFinishes as sub-properties

interval meets
type: ObjectProperty
inverse of: interval met by
domain: Proper interval
range: Proper interval
comment: If a proper interval T1 is intervalMeets another proper interval T2, then the end of T1 is coincident with the beginning of T2.
comment: Si un intervalo propio T1 se encuentra con otro intervalo propio T2, entonces el final de T1 coincide con el principio de T2. @es
label: intervalo se encuentra @es

interval met by
type: ObjectProperty
domain: Proper interval
range: Proper interval
comment: If a proper interval T1 is intervalMetBy another proper interval T2, then the beginning of T1 is coincident with the end of T2.
comment: Si un intervalo propio T1 es 'intervalo encontrado por' otro intervalo propio T2, entonces el principio de T1 coincide con el final de T2. @es
label: intervalo encontrado por @es

interval overlapped by
type: ObjectProperty
inverse of: interval overlaps
domain: Proper interval
range: Proper interval
comment: If a proper interval T1 is intervalOverlappedBy another proper interval T2, then the beginning of T1 is after the beginning of T2, the beginning of T1 is before the end of T2, and the end of T1 is after the end of T2.
comment: Si un intervalo propio T1 es 'intervalo solapado por' otro intervalo propio T2, entonces el principio de T1 es posterior al principio de T2, y el principio de T1 es anterior al final de T2, y el final de T1 es posterior al final de T2. @es
label: intervalo solapado por @es

interval overlaps
type: ObjectProperty
domain: Proper interval
range: Proper interval
comment: Asume una dirección en el tiempo. Si una entidad temporal T1 está después de otra entidad temporal T2, entonces el principio de T1 está después del final de T2. @es
comment: If a proper interval T1 is intervalOverlaps another proper interval T2, then the beginning of T1 is before the beginning of T2, the end of T1 is after the beginning of T2, and the end of T1 is before the end of T2.
comment: Si un intervalo propio T1 se solapa con otro intervalo propio T2, entonces el principio de T1 es anterior al principio de T2, el final de T1 es posterior al principio de T2, y el final de T1 es anterior al final de T2. @es
label: intervalo se solapa @es

interval started by
type: ObjectProperty
inverse of: interval starts
domain: Proper interval
range: Proper interval
comment: If a proper interval T1 is intervalStarted another proper interval T2, then the beginning of T1 is coincident with the beginning of T2, and the end of T1 is after the end of T2.
comment: Si un intervalo propio T1 es empezado por otro intervalo propio T2, entonces el principio de T1 coincide con el principio de T2, y el final de T1 es posterior al final de T2. @es

interval starts
type: ObjectProperty
sub property of: interval in
domain: Proper interval
range: Proper interval
comment: If a proper interval T1 is intervalStarts another proper interval T2, then the beginning of T1 is coincident with the beginning of T2, and the end of T1 is before the end of T2.
comment: Si un intervalo propio T1 empieza otro intervalo propio T2, entonces del principio de T1 con el principio de T2, y el final de T1 es anterior al final de T2. @es
label: intervalo empieza @es
definition: Si un intervalo propio T1 empieza otro intervalo propio T2, entonces del principio de T1 con el final de T2, y el final de T1 es anterior al final de T2. @es

month of year
type: ObjectProperty
domain: Generalized date-time description
range: Month of year
comment: El mes del año, cuyo valor es un miembro de la clase 'mes del año'. @es
comment: The month of the year, whose value is a member of the class time:MonthOfYear
label: mes del año @es
editorial note: Característica arriesgada - añadida en la revisión de 2017, y todavía no ampliamente utilizada. @es
editorial note: Feature at risk - added in 2017 revision, and not yet widely used.

in time zone
type: ObjectProperty
domain: Generalized date-time description
range: Time Zone
comment: The time zone for clock elements in the temporal position
label: en huso horario @es
history note: En la versión original de OWL-Time de 2006, el rango de 'en huso horario' se definió en un espacio de nombres diferente "http://www.w3.org/2006/timezone#". Un axioma de alineación permite que los datos codificados de acuerdo con la versión anterior sean consistentes con la ontología actualizada. @es
history note: In the original 2006 version of OWL-Time, the range of time:timeZone was a TimeZone class in a separate namespace "http://www.w3.org/2006/timezone#". An alignment axiom tzont:TimeZone rdfs:subClassOf time:TimeZone . allows data encoded according to the previous version to be consistent with the updated ontology.
note: IANA mantiene una base de datos de husos horarios. Éstas están bien mantenidas y generalmente se consideran autorizadas, pero los ítems individuales no están disponibles en URIs individuales, por tanto, no se pueden utilizar directamente en datos expresados utilizando OWL-Time. La BDPedia proporciona un conjunto de recursos correspondientes a los husos horarios de IANA, con una URI para cada uno (por ejemplo, http://dbpedia.org/resource/Australia/Eucla). El Servicio de Reloj Mundial también proporciona una lista de husos horarios con la descripción de cada uno de los disponibles como una página Web individual con una URI adecuada individual (por ejemplo, https://www.timeanddate.com/time/zones/acwst). Éstos, y otros recursos similares, se puden usar como un valor de la propiedad 'huso horario'. @es
note: IANA maintains a database of timezones. These are well maintained and generally considered authoritative, but individual items are not available at individual URIs, so cannot be used directly in data expressed using OWL-Time. DBPedia provides a set of resources corresponding to the IANA timezones, with a URI for each (e.g. http://dbpedia.org/resource/Australia/Eucla). The World Clock service also provides a list of time zones with the description of each available as an individual webpage with a convenient individual URI (e.g. https://www.timeanddate.com/time/zones/acwst). These or other, similar, resources might be used as a value of the time:timeZone property.

temporal unit type
type: ObjectProperty
domain: Class
  union of: duración de tiempo
  union of: Generalized date-time description
range: Temporal unit
comment: La unidad de tiempo que proporciona la precisión de un valor fecha-hora o la escala de una extensión temporal. @es
comment: The temporal unit which provides the precision of a date-time value or scale of a temporal extent
label: tipo de unidad temporal @es

day
type: DatatypeProperty
domain: Generalized date-time description
comment: Day position in a calendar-clock system. The range of this property is not specified, so can be replaced by any specific representation of a calendar day from any calendar.
comment: Posición de día en un sistema calendario-reloj. @es
label: día @es
definition: Posición de día en un sistema calendario-reloj. El rango de esta propiedad no está especificado, por tanto, se puede reemplazar por una representación específica de un día de calendario de cualquier calendario. @es

day of year
type: DatatypeProperty
domain: Generalized date-time description
range: nonNegativeInteger
comment: El número de día en el año. @es
comment: The number of the day within the year
label: día del año @es

days duration
type: DatatypeProperty
domain: Generalized duration description
range: decimal
comment: Longitud de, o elemento de la longitud de, una extensión temporal expresada en días. @es
comment: length of, or element of the length of, a temporal extent expressed in days
label: duración en días @es

has XSD duration
type: DatatypeProperty
domain: Temporal entity
range: duration
comment: Extensión de una entidad temporal, expresada utilizando xsd:duration. @es
comment: Extent of a temporal entity, expressed using xsd:duration
label: tiene duración XSD @es
editorial note: Característica arriesgada - añadida en la revisión de 2017, y todavía no ampliamente utilizada. @es
editorial note: Feature at risk - added in 2017 revision, and not yet widely used.

hour
type: DatatypeProperty
domain: Generalized date-time description
range: nonNegativeInteger
comment: Hour position in a calendar-clock system.
comment: Posición de hora en un sistema calendario-reloj. @es
label: hora @es

hours duration
type: DatatypeProperty
domain: Generalized duration description
range: decimal
comment: Longitud de, o elemento de la longitud de, una extensión temporal expresada en horas. @es
comment: length of, or element of the length of, a temporal extent expressed in hours
label: duración en horas @es

in XSD date
type: DatatypeProperty
domain: Time instant
range: date
comment: Posición de un instante, expresado utilizando xsd:date. @es
comment: Position of an instant, expressed using xsd:date
label: en fecha XSD @es

in XSD Date-Time
type: DatatypeProperty
domain: Time instant
range: dateTime
comment: Posición de un instante, expresado utilizando xsd:dateTime. @es
comment: Position of an instant, expressed using xsd:dateTime
label: en fecha-tiempo XSD @es
deprecated: true
note: La propiedad 'en fecha-hora XSD' ha sido reemplazada por 'en fecha-sello de tiempo XSD' que hace obligatorio el campo 'huso horario'. @es
note: The property :inXSDDateTime is replaced by :inXSDDateTimeStamp which makes the time-zone field mandatory.

in XSD Date-Time-Stamp
type: DatatypeProperty
domain: Time instant
range: dateTimeStamp
comment: Posición de un instante, expresado utilizando xsd:dateTimeStamp. @es
comment: Position of an instant, expressed using xsd:dateTimeStamp
label: en fecha-sello de tiempo XSD @es

in XSD g-Year
type: DatatypeProperty
domain: Time instant
range: gYear
comment: Posición de un instante, expresado utilizando xsd:gYear. @es
comment: Position of an instant, expressed using xsd:gYear
label: en año gregoriano XSD @es

in XSD g-YearMonth
type: DatatypeProperty
domain: Time instant
range: gYearMonth
comment: Posición de un instante, expresado utilizando xsd:gYearMonth. @es
comment: Position of an instant, expressed using xsd:gYearMonth
label: en año-mes gregoriano XSD @es

minute
type: DatatypeProperty
domain: Generalized date-time description
range: nonNegativeInteger
comment: Minute position in a calendar-clock system.
comment: Posición de minuto en un sistema calendario-reloj. @es
label: minuto @es

minutes
type: DatatypeProperty
domain: Generalized duration description
range: decimal
comment: Longitud de, o elemento de la longitud de, una extensión temporal expresada en minutos. @es
comment: length, or element of, a temporal extent expressed in minutes
label: minutos @es

month
type: DatatypeProperty
domain: Generalized date-time description
comment: Month position in a calendar-clock system. The range of this property is not specified, so can be replaced by any specific representation of a calendar month from any calendar.
comment: Posición de mes en un sistema calendario-reloj. El rango de esta propiedad no está especificado, por tanto, se puede reemplazar por cualquier representación específica de un mes de calendario de un calendario cualquiera. @es
label: mes @es

months duration
type: DatatypeProperty
domain: Generalized duration description
range: decimal
comment: Longitud de, o elemento de la longitud de, una extensión temporal expresada en meses. @es
comment: length of, or element of the length of, a temporal extent expressed in months
label: duración en meses @es

Name of temporal position
type: DatatypeProperty
domain: Time position
range: string
comment: El valor (nominal) que indica posición temporal en un sistema de referencia ordinal. @es
comment: The (nominal) value indicating temporal position in an ordinal reference system
label: nombre de posición temporal @es

Numeric value of temporal duration
type: DatatypeProperty
domain: duración de tiempo
range: decimal
comment: Valor de una extensión temporal expresada como un número decimal escalado por una unidad de tiempo. @es
comment: Value of a temporal extent expressed as a decimal number scaled by a temporal unit
label: valor numérico de duración temporal @es

Numeric value of temporal position
type: DatatypeProperty
domain: Time position
range: decimal
comment: El valor (numérico) que indica posición temporal en un sistema de referencia ordinal. @es
comment: The (numeric) value indicating position within a temporal coordinate system
label: valor numérico de posición temporal @es

second
type: DatatypeProperty
domain: Generalized date-time description
range: decimal
comment: Posición de segundo en un sistema calendario-reloj. @es
comment: Second position in a calendar-clock system.
label: segundo @es

seconds duration
type: DatatypeProperty
domain: Generalized duration description
range: decimal
comment: Longitud de, o elemento de la longitud de, una extensión temporal expresada en segundos. @es
comment: length of, or element of the length of, a temporal extent expressed in seconds
label: duración en segundos @es

week
type: DatatypeProperty
domain: Generalized date-time description
range: nonNegativeInteger
comment: Número de semana en el año. @es
comment: Week number within the year.
label: semana @es
note: Weeks are numbered differently depending on the calendar in use and the local language or cultural conventions (locale). ISO-8601 specifies that the first week of the year includes at least four days, and that Monday is the first day of the week. In that system, week 1 is the week that contains the first Thursday in the year.
scope note: Las semanas están numeradas de forma diferente dependiendo del calendario en uso y de las convenciones lingüísticas y culturales locales (locale en inglés). El ISO-8601 especifica que la primera semana del año incluye al menos cuatro días, y que el lunes es el primer día de la semana. En ese sistema, la semana 1 es la semana que contiene el primer jueves del año. @es

weeks duration
type: DatatypeProperty
domain: Generalized duration description
range: decimal
comment: Longitud de, o elemento de la longitud de, una extensión temporal expresada en semanas. @es
comment: length of, or element of the length of, a temporal extent expressed in weeks
label: duración en semanas @es

has XSD date-time
type: DatatypeProperty
domain: Date-time interval
range: dateTime
comment: Valor de 'intervalo de fecha-hora' expresado como un valor compacto. @es
comment: Value of DateTimeInterval expressed as a compact value.
label: tiene fecha-hora XSD @es
deprecated: true
note: Using xsd:dateTime in this place means that the duration of the interval is implicit: it corresponds to the length of the smallest non-zero element of the date-time literal. However, this rule cannot be used for intervals whose duration is more than one rank smaller than the starting time - e.g. the first minute or second of a day, the first hour of a month, or the first day of a year. In these cases the desired interval cannot be distinguished from the interval corresponding to the next rank up. Because of this essential ambiguity, use of this property is not recommended and it is deprecated.
note: Utilizando xsd:dateTime en este lugar significa que la duración del intervalo está implícita: se corresponde con la longitud del elemento más pequeño distinto de cero del literal fecha-hora. Sin embargo, esta regla no se puede utilizar para intervalos cuya duración es mayor que un rango más pequeño que el tiempo de comienzo - p.ej. el primer minuto o segundo del día, la primera hora del mes, o el primer día del año. En estos casos el intervalo deseado no se puede distinguir del intervalo correspondiente al próximo rango más alto. Debido a esta ambigüedad esencial, no se recomienda el uso de esta propiedad y está desaprobada.

year
type: DatatypeProperty
domain: Generalized date-time description
comment: Posición de año en un sistema calendario-reloj. l rango de esta propiedad no está especificado, por tanto, se puede reemplazar por cualquier representación específica de un año de calendario de un calendario cualquiera. @es
comment: Year position in a calendar-clock system. The range of this property is not specified, so can be replaced by any specific representation of a calendar year from any calendar.

years duration
type: DatatypeProperty
domain: Generalized duration description
range: decimal
comment: Longitud de, o elemento de la longitud de, una extensión temporal expresada en años. @es
comment: length of, or element of the length of, a temporal extent expressed in years
label: duración en años @es

Date-Time description
type: Class
subclass of: Generalized date-time description
subclass of: Restriction
  on property: Temporal reference system used
  has value: Gregorian
subclass of: Restriction
  on property: day
  all values from: gDay
subclass of: Restriction
  on property: month
  all values from: gMonth
subclass of: Restriction
  on property: year
  all values from: gYear
comment: Descripción de fecha y tiempo estructurada con valores separados para los diferentes elementos de un sistema calendario-reloj. El sistema de referencia temporal está fijado al calendario gregoriano, y el rango de las propiedades año, mes, día restringidas a los correspondientes tipos del XML Schema xsd:gYear, xsd:gMonth y xsd:gDay respectivamente. @es
comment: Description of date and time structured with separate values for the various elements of a calendar-clock system. The temporal reference system is fixed to Gregorian Calendar, and the range of year, month, day properties restricted to corresponding XML Schema types xsd:gYear, xsd:gMonth and xsd:gDay, respectively.
label: descripción de fecha-tiempo @es

Date-time interval
type: Class
subclass of: Proper interval
comment: 'intervalo de fecha-hora' es una subclase de 'intervalo propio', definida utilizando el multi-elemento 'descripción de fecha-hora'. @es
comment: DateTimeInterval is a subclass of ProperInterval, defined using the multi-element DateTimeDescription.
label: intervalo de fecha-hora @es
note: 'intervalo de fecha-hora' se puede utilizar sólo para un intervalo cuyos límites coinciden con un elemento de fecha-hora alineados con el calendario y la zona horaria indicados. Por ejemplo, aunque ambos tienen una duración de un día, el intervalo de 24 horas que empieza en la media noche del comienzo del 8 mayo en Europa Central se puede expresar como un 'intervalo de fecha-hora', el intervalo de 24 horas que empieza a las 1:30pm no. @es
note: :DateTimeInterval can only be used for an interval whose limits coincide with a date-time element aligned to the calendar and timezone indicated. For example, while both have a duration of one day, the 24-hour interval beginning at midnight at the beginning of 8 May in Central Europe can be expressed as a :DateTimeInterval, but the 24-hour interval starting at 1:30pm cannot.

Day of week
type: Class
subclass of: Thing
comment: El día de la semana @es
comment: The day of week
label: día de la semana @es
change note: Remove enumeration from definition, in order to allow other days to be used when required in other calendars. NOTE: existing days are still present as members of the class, but the class membership is now open. In the original OWL-Time the following constraint appeared: owl:oneOf ( time:Monday time:Tuesday time:Wednesday time:Thursday time:Friday time:Saturday time:Sunday ) ;
note: La pertenencia a la clase 'día de la semana' está abierta, para permitir longitudes de semana alternativas y diferentes nombres de días. @es
note: Membership of the class :DayOfWeek is open, to allow for alternative week lengths and different day names.

duración de tiempo
type: Class
subclass of: Temporal duration
subclass of: Restriction
  on property: temporal unit type
  cardinality: 1
subclass of: Restriction
  on property: Numeric value of temporal duration
  cardinality: 1
comment: Duración de una extensión temporal expresada como un número escalado por una unidad temporal. @es
comment: Duration of a temporal extent expressed as a number scaled by a temporal unit
label: Time duration
note: Alternativa a 'descripción de tiempo' para proporcionar descripción soporte a una duración temporal diferente a utilizar un sistema de calendario/reloj. @es
note: Alternative to time:DurationDescription to support description of a temporal duration other than using a calendar/clock system.

Duration description
type: Class
subclass of: Generalized duration description
subclass of: Restriction
  on property: Temporal reference system used
  has value: Gregorian
subclass of: Restriction
  on property: days duration
  all values from: decimal
subclass of: Restriction
  on property: hours duration
  all values from: decimal
subclass of: Restriction
  on property: minutes
  all values from: decimal
subclass of: Restriction
  on property: months duration
  all values from: decimal
subclass of: Restriction
  on property: seconds duration
  all values from: decimal
subclass of: Restriction
  on property: weeks duration
  all values from: decimal
subclass of: Restriction
  on property: years duration
  all values from: decimal
comment: Descripción de extensión temporal estructurada con valores separados para los distintos elementos de un sistema de horario-calendario. El sistema de referencia temporal se fija al calendario gregoriano, y el intervalo de cada una de las propiedades numéricas se restringe a xsd:decimal. @es
comment: Description of temporal extent structured with separate values for the various elements of a calendar-clock system. The temporal reference system is fixed to Gregorian Calendar, and the range of each of the numeric properties is restricted to xsd:decimal
label: descripción de duración @es
note: En el calendario gregoriano la longitud de los meses no es fija. Por lo tanto, un valor como "2,5 meses" no se puede comparar exactamente con una duración similar expresada en términos de semanas o días. @es
note: In the Gregorian calendar the length of the month is not fixed. Therefore, a value like "2.5 months" cannot be exactly compared with a similar duration expressed in terms of weeks or days.

Generalized date-time description
type: Class
subclass of: Temporal position
subclass of: Restriction
  on property: temporal unit type
  cardinality: 1
subclass of: Restriction
  on property: day of week
  max cardinality: 1
subclass of: Restriction
  on property: month of year
  max cardinality: 1
subclass of: Restriction
  on property: in time zone
  max cardinality: 1
subclass of: Restriction
  on property: day
  max cardinality: 1
subclass of: Restriction
  on property: day of year
  max cardinality: 1
subclass of: Restriction
  on property: hour
  max cardinality: 1
subclass of: Restriction
  on property: minute
  max cardinality: 1
subclass of: Restriction
  on property: month
  max cardinality: 1
subclass of: Restriction
  on property: second
  max cardinality: 1
subclass of: Restriction
  on property: week
  max cardinality: 1
subclass of: Restriction
  on property: year
  max cardinality: 1
comment: Descripción de fecha y hora estructurada con valores separados para los distintos elementos de un sistema calendario-reloj.
comment: Description of date and time structured with separate values for the various elements of a calendar-clock system
label: descripción de fecha-hora generalizada @es
note: Algunas combinaciones de propiedades son redundantes - por ejemplo, dentro de un 'año' especificado si se proporciona 'día del año' entonces 'día' y 'mes' se pueden computar, y viceversa. Los valores individuales deberían ser consistentes entre ellos y con el calendario, indicado a través del valor de la propiedad 'tiene TRS'. @es
note: Some combinations of properties are redundant - for example, within a specified :year if :dayOfYear is provided then :day and :month can be computed, and vice versa. Individual values should be consistent with each other and the calendar, indicated through the value of the :hasTRS property.

Generalized duration description
type: Class
subclass of: Temporal duration
subclass of: Restriction
  on property: Temporal reference system used
  cardinality: 1
subclass of: Restriction
  on property: days duration
  max cardinality: 1
subclass of: Restriction
  on property: hours duration
  max cardinality: 1
subclass of: Restriction
  on property: minutes
  max cardinality: 1
subclass of: Restriction
  on property: months duration
  max cardinality: 1
subclass of: Restriction
  on property: seconds duration
  max cardinality: 1
subclass of: Restriction
  on property: weeks duration
  max cardinality: 1
subclass of: Restriction
  on property: years duration
  max cardinality: 1
comment: Descripción de extensión temporal estructurada con valores separados para los distintos elementos de un sistema de horario-calendario. @es
comment: Description of temporal extent structured with separate values for the various elements of a calendar-clock system.
label: descripción de duración generalizada @es
note: La extensión de una duración de tiempo expresada como una 'descripción de duración general' depende del Sistema de Referencia Temporal. En algunos calendarios la longitud de la semana o del mes no es constante a lo largo del año. Por tanto, un valor como "25 meses" puede no ser necesariamente ser comparado con un duración similar expresada en términos de semanas o días. Cuando se consideran calendarios que no están basados en el movimiento de la Tierra, se deben tomar incluso más precauciones en la comparación de duraciones. @es
note: The extent of a time duration expressed as a GeneralDurationDescription depends on the Temporal Reference System. In some calendars the length of the week or month is not constant within the year. Therefore, a value like "2.5 months" may not necessarily be exactly compared with a similar duration expressed in terms of weeks or days. When non-earth-based calendars are considered even more care must be taken in comparing durations.

Time instant
type: Class
subclass of: Temporal entity
disjoint with: Proper interval
comment: A temporal entity with zero extent or duration
comment: Una entidad temporal con una extensión o duración cero. @es
label: instante de tiempo. @es

Time interval
type: Class
subclass of: Temporal entity
comment: A temporal entity with an extent or duration
comment: Una entidad temporal con una extensión o duración. @es
label: intervalo de tiempo @es

January
type: Class
subclass of: Date-Time description
subclass of: Restriction
  on property: temporal unit type
  has value: Month (unit of temporal duration)
subclass of: Restriction
  on property: month
  has value: --01
deprecated: true
history note: This class was present in the 2006 version of OWL-Time. It was presented as an example of how DateTimeDescription could be specialized, but does not belong in the revised ontology.

Month of year
type: Class
subclass of: Date-Time description
subclass of: Restriction
  on property: temporal unit type
  has value: Month (unit of temporal duration)
subclass of: Restriction
  on property: day
  cardinality: 0
subclass of: Restriction
  on property: hour
  cardinality: 0
subclass of: Restriction
  on property: minute
  cardinality: 0
subclass of: Restriction
  on property: month
  cardinality: 1
subclass of: Restriction
  on property: second
  cardinality: 0
subclass of: Restriction
  on property: week
  cardinality: 0
subclass of: Restriction
  on property: year
  cardinality: 0
comment: El mes del año. @es
comment: The month of the year
label: mes del año @es
editorial note: Característica en riesgo - añadida en la revisión de 2017, y no utilizada todavía de forma amplia. @es
editorial note: Feature at risk - added in 2017 revision, and not yet widely used.
note: La pertenencia a la clase 'mes del año' está abierta, a permitir calendarios anuales alternativos y diferentes nombres de meses. @es
note: Membership of the class :MonthOfYear is open, to allow for alternative annual calendars and different month names.

Proper interval
type: Class
subclass of: Time interval
comment: A temporal entity with non-zero extent or duration, i.e. for which the value of the beginning and end are different
comment: Una entidad temporal con extensión o duración distinta de cero, es decir, para la cual los valores de principio y fin del intervalo son diferentes. @es
label: intervalo propio @es

Temporal Reference System
type: Class
comment: A temporal reference system, such as a temporal coordinate system (with an origin, direction, and scale), a calendar-clock combination, or a (possibly hierarchical) ordinal system. This is a stub class, representing the set of all temporal reference systems.
comment: Un sistema de referencia temporal, tal como un sistema de coordenadas temporales (con un origen, una dirección y una escala), una combinación calendario-reloj, o un sistema ordinal (posiblemente jerárquico). Esta clase comodín representa el conjunto de todos los sistemas de referencia temporal. @es
label: sistema de referencia temporal @es
note: A taxonomy of temporal reference systems is provided in ISO 19108:2002 [ISO19108], including (a) calendar + clock systems; (b) temporal coordinate systems (i.e. numeric offset from an epoch); (c) temporal ordinal reference systems (i.e. ordered sequence of named intervals, not necessarily of equal duration).
note: En el ISO 19108:2002 [ISO19108] se proporciona una taxonomía de sistemas de referencia temporal, incluyendo (a) sistemas de calendario + reloj; (b) sistemas de coordenadas temporales (es decir, desplazamiento numérico a partir de una época); (c) sistemas de referencia ordinales temporales (es decir, secuencia ordenada de intervalos nombrados, no necesariamente de igual duración). @es

Temporal duration
type: Class
comment: Extensión de tiempo; duración de un intervalo de tiempo independiente de su posición de inicio particular. @es
comment: Time extent; duration of a time interval separate from its particular start position
label: duración temporal @es

Temporal entity
type: Class
equivalent class: Class
  union of: Time instant
  union of: Time interval
subclass of: Thing
comment: A temporal interval or instant.
comment: Un intervalo temporal o un instante. @es
label: entidad temporal @es

Temporal position
type: Class
subclass of: Restriction
  on property: Temporal reference system used
  cardinality: 1
comment: A position on a time-line
comment: Una posición sobre una línea de tiempo. @es
label: posición temporal @es

Temporal unit
type: Class
subclass of: Temporal duration
comment: A standard duration, which provides a scale factor for a time extent, or the granularity or precision for a time position.
comment: Una duración estándar, que proporciona un factor de escala para una extensión de tiempo, o la granularidad o precisión para una posición de tiempo. @es
label: unidad de tiempo @es
change note: Remove enumeration from definition, in order to allow other units to be used when required in other coordinate systems. NOTE: existing units are still present as members of the class, but the class membership is now open. In the original OWL-Time the following constraint appeared: owl:oneOf ( time:unitSecond time:unitMinute time:unitHour time:unitDay time:unitWeek time:unitMonth time:unitYear ) ;
note: La pertenencia de la clase 'unidad de tiempo' está abierta, para permitir otras unidades de tiempo utilizadas en algunas aplicaciones técnicas (por ejemplo, millones de años o el mes Baha'i). @es
note: Membership of the class TemporalUnit is open, to allow for other temporal units used in some technical applications (e.g. millions of years, Baha'i month).

Time position
type: Class
subclass of: Temporal position
subclass of: Class
  union of: Restriction
    on property: Name of temporal position
    cardinality: 1
  union of: Restriction
    on property: Numeric value of temporal position
    cardinality: 1
comment: A temporal position described using either a (nominal) value from an ordinal reference system, or a (numeric) value in a temporal coordinate system.
comment: Una posición temporal descrita utilizando bien un valor (nominal) de un sistema de referencia ordinal, o un valor (numérico) en un sistema de coordenadas temporales. @es
label: posición de tiempo @es

Time Zone
type: Class
comment: A Time Zone specifies the amount by which the local time is offset from UTC. A time zone is usually denoted geographically (e.g. Australian Eastern Daylight Time), with a constant value in a given region. The region where it applies and the offset from UTC are specified by a locally recognised governing authority.
comment: Un huso horario especifica la cantidad en que la hora local está desplazada con respecto a UTC. Un huso horario normalmente se denota geográficamente (p.ej. el horario de verano del este de Australia), con un valor constante en una región dada. La región donde aplica y el desplazamiento desde UTC las especifica una autoridad gubernamental localmente reconocida. @es
label: huso horario @es
history note: En la versión original de OWL-Time de 2006, se definió, en un espacio de nombres diferente "http://www.w3.org/2006/timezone#", la clase 'huso horario', con varias propiedades específicas correspondientes a un modelo específico de huso horario. En la versión actual hay una clase con el mismo nombre local en el espacio de nombres de OWL-Time, eliminando la dependencia del espacio de nombres externo. Un axioma de alineación permite que los datos codificados de acuerdo con la versión anterior sean consistentes con la ontología actualizada. @es
history note: In the original 2006 version of OWL-Time, the TimeZone class, with several properties corresponding to a specific model of time-zones, was defined in a separate namespace "http://www.w3.org/2006/timezone#". In the current version a class with same local name is put into the main OWL-Time namespace, removing the dependency on the external namespace. An alignment axiom tzont:TimeZone rdfs:subClassOf time:TimeZone . allows data encoded according to the previous version to be consistent with the updated ontology.
note: A designated timezone is associated with a geographic region. However, for a particular region the offset from UTC often varies seasonally, and the dates of the changes may vary from year to year. The timezone designation usually changes for the different seasons (e.g. Australian Eastern Standard Time vs. Australian Eastern Daylight Time). Furthermore, the offset for a timezone may change over longer timescales, though its designation might not. Detailed guidance about working with time zones is given in http://www.w3.org/TR/timezone/ .
note: An ontology for time zone descriptions was described in [owl-time-20060927] and provided as RDF in a separate namespace tzont:. However, that ontology was incomplete in scope, and the example datasets were selective. Furthermore, since the use of a class from an external ontology as the range of an ObjectProperty in OWL-Time creates a dependency, reference to the time zone class has been replaced with the 'stub' class in the normative part of this version of OWL-Time.
note: Un huso horario designado está asociado con una región geográfica. Sin embargo, para una región particular el desplazamiento desde UTC a menudo varía según las estaciones, y las fechas de los cambios pueden variar de un año a otro. La designación de huso horario normalmente cambia de una estación a otra (por ejemplo, el horario estándar frente al horario de verano ambos del este de Australia). Además, del desplazamiento para un huso horario puede cambiar sobre escalas de tiempo mayores, aunque su designación no lo haga. Se puede encontrar una guía detallada sobre el funcionamiento de husos horarios en http://www.w3.org/TR/timezone/."@es , "En [owl-time-20060927] se describió una ontología para descripciones de husos horarios, y se proporcionó en un espacio de nombres separado tzont:. Sin embargo, dicha ontología estaba incompleta en su alcance, y el ejemplo de conjuntos de datos (datasets) era selectivo. Además, puesto que el uso de una clase de una ontología externa como el rango de una propiedad de objeto en OWL-Time crea una dependencia, la referencia a la clase huso horario se ha reemplazado por una clase que viene a ser un "cajón de sastre" en la en la parte normativa de esta versión de OWL-Time. @es
scope note: En esta implementación 'huso horario' no tiene definidas propiedades. Se debería pensar como una superclase "abstracta" de todas las implementaciones de huso horario específicas. @es
scope note: In this implementation TimeZone has no properties defined. It should be thought of as an 'abstract' superclass of all specific timezone implementations.

Year
type: Class
subclass of: Duration description
subclass of: Restriction
  on property: days duration
  cardinality: 0
subclass of: Restriction
  on property: hours duration
  cardinality: 0
subclass of: Restriction
  on property: minutes
  cardinality: 0
subclass of: Restriction
  on property: months duration
  cardinality: 0
subclass of: Restriction
  on property: seconds duration
  cardinality: 0
subclass of: Restriction
  on property: weeks duration
  cardinality: 0
subclass of: Restriction
  on property: years duration
  cardinality: 1
comment: Year duration
deprecated: true
history note: Year was proposed in the 2006 version of OWL-Time as an example of how DurationDescription could be specialized to allow for a duration to be restricted to a number of years. It is deprecated in this edition of OWL-Time.
preferred label: Anno @it
preferred label: Année (calendrier) @fr
preferred label: Ano @pt
preferred label: Año @es
preferred label: Jaar @nl
preferred label: Jahr @de
preferred label: Rok @pl
preferred label: Год @ru
preferred label: سنة @ar
preferred label: 年 @ja

Friday
type: NamedIndividual
type: Day of week
preferred label: Freitag @de
preferred label: Piątek @pl
preferred label: Sexta-feira @pt
preferred label: Vendredi @fr
preferred label: Venerdì @it
preferred label: Viernes @es
preferred label: Vrijdag @nl
preferred label: Пятница @ru
preferred label: الجمعة @ar
preferred label: 星期五 @zh
preferred label: 金曜日 @ja

Monday
type: NamedIndividual
type: Day of week
preferred label: Lundi @fr
preferred label: Lunedì @it
preferred label: Lunes @es
preferred label: Maandag @nl
preferred label: Montag @de
preferred label: Poniedziałek @pl
preferred label: Segunda-feira @pt
preferred label: Понедельник @ru
preferred label: الاثنين @ar
preferred label: 星期一 @zh
preferred label: 月曜日 @ja

Saturday
type: NamedIndividual
type: Day of week
preferred label: Sabato @it
preferred label: Samedi @fr
preferred label: Samstag @de
preferred label: Sobota @pl
preferred label: Sábado @es
preferred label: Zaterdag @nl
preferred label: Суббота @ru
preferred label: السبت @ar
preferred label: 土曜日 @ja
preferred label: 星期六 @zh

Sunday
type: NamedIndividual
type: Day of week
preferred label: Dimanche @fr
preferred label: Domenica @it
preferred label: Domingo @es
preferred label: Niedziela @pl
preferred label: Sonntag @de
preferred label: Zondag @nl
preferred label: Воскресенье @ru
preferred label: الأحد (يوم) @ar
preferred label: 日曜日 @ja
preferred label: 星期日 @zh

Thursday
type: NamedIndividual
type: Day of week
preferred label: Czwartek @pl
preferred label: Donderdag @nl
preferred label: Donnerstag @de
preferred label: Giovedì @it
preferred label: Jeudi @fr
preferred label: Jueves @es
preferred label: Quinta-feira @pt
preferred label: Четверг @ru
preferred label: الخميس @ar
preferred label: 星期四 @zh
preferred label: 木曜日 @ja

Tuesday
type: NamedIndividual
type: Day of week
preferred label: Dienstag @de
preferred label: Dinsdag @nl
preferred label: Mardi @fr
preferred label: Martedì @it
preferred label: Martes @es
preferred label: Terça-feira @pt
preferred label: Wtorek @pl
preferred label: Вторник @ru
preferred label: الثلاثاء @ar
preferred label: 星期二 @zh
preferred label: 火曜日 @ja

Wednesday
type: NamedIndividual
type: Day of week
preferred label: Mercoledì @it
preferred label: Mercredi @fr
preferred label: Mittwoch @de
preferred label: Miércoles @es
preferred label: Quarta-feira @pt
preferred label: Woensdag @nl
preferred label: Środa @pl
preferred label: Среда @ru
preferred label: الأربعاء @ar
preferred label: 星期三 @zh
preferred label: 水曜日 @ja

Day (unit of temporal duration)
type: NamedIndividual
type: Temporal unit
days duration: 1
hours duration: 0
minutes: 0
months duration: 0
seconds duration: 0
weeks duration: 0
years duration: 0
preferred label: Tag @de
preferred label: dag @nl
preferred label: day
preferred label: dia @pt
preferred label: doba @pl
preferred label: día @es
preferred label: giorno @it
preferred label: jour @fr
preferred label: يوماً ما @ar
preferred label: ある日 @jp
preferred label: 一天 @zh
preferred label: 언젠가 @kr

один час"@ru
type: NamedIndividual
type: Temporal unit
days duration: 0
hours duration: 1
minutes: 0
months duration: 0
seconds duration: 0
weeks duration: 0
years duration: 0
label: Hour (unit of temporal duration)
preferred label: Stunde @de
preferred label: godzina @pl
preferred label: heure @fr
preferred label: hora @es
preferred label: hour
preferred label: ora @it
preferred label: uur @nl
preferred label: ساعة واحدة @ar
preferred label: 一小時 @zh
preferred label: 一時間 @jp
preferred label: 한 시간 @kr

Minute (unit of temporal duration)
type: NamedIndividual
type: Temporal unit
days duration: 0
hours duration: 0
minutes: 1
months duration: 0
seconds duration: 0
weeks duration: 0
years duration: 0
preferred label: Minute @de
preferred label: minuta @pl
preferred label: minute
preferred label: minuto @es
preferred label: minuut @nl
preferred label: одна минута @ru
preferred label: دقيقة واحدة @ar
preferred label: 一分 @jp
preferred label: 等一下 @zh
preferred label: 분 @kr

Month (unit of temporal duration)
type: NamedIndividual
type: Temporal unit
days duration: 0
hours duration: 0
minutes: 0
months duration: 1
seconds duration: 0
weeks duration: 0
years duration: 0
preferred label: Monat @de
preferred label: maand @nl
preferred label: mes @es
preferred label: mese @it
preferred label: miesiąc @pl
preferred label: mois @fr
preferred label: month
preferred label: один месяц @ru
preferred label: شهر واحد @ar
preferred label: 一か月 @jp
preferred label: 一個月 @zh
preferred label: 한달 @kr

Second (unit of temporal duration)
type: NamedIndividual
type: Temporal unit
days duration: 0
hours duration: 0
minutes: 0
months duration: 0
seconds duration: 1
weeks duration: 0
years duration: 0
preferred label: Sekunde @de
preferred label: Sekundę @pl
preferred label: second
preferred label: seconde @fr
preferred label: secondo @it
preferred label: segundo @es
preferred label: ثانية واحدة @ar
preferred label: 一秒 @jp
preferred label: 일초 @kr

Week (unit of temporal duration)
type: NamedIndividual
type: Temporal unit
days duration: 0
hours duration: 0
minutes: 0
months duration: 0
seconds duration: 0
weeks duration: 1
years duration: 0
preferred label: Woche @de
preferred label: semaine @fr
preferred label: semana @es
preferred label: settimana @it
preferred label: tydzień @pl
preferred label: week
preferred label: одна неделя @ru
preferred label: سبوع واحد @ar
preferred label: 一周 @zh
preferred label: 一週間 @jp
preferred label: 일주일 @kr

Year (unit of temporal duration)
type: NamedIndividual
type: Temporal unit
days duration: 0
hours duration: 0
minutes: 0
months duration: 0
seconds duration: 0
weeks duration: 0
years duration: 1
preferred label: 1 년 @kr
preferred label: 1年 @jp
preferred label: Jahr @de
preferred label: an @fr
preferred label: anno @it
preferred label: ano @pt
preferred label: jaar @nl
preferred label: rok @pl
preferred label: un año @es
preferred label: year
preferred label: один год @ru
preferred label: سنة واحدة @ar
preferred label: 一年 @zh

pattern: -?([1-9][0-9]{3,}|0[0-9]{3})(Z|(\+|-)((0[0-9]|1[0-3]):[0-5][0-9]|14:00))?

pattern: ---(0[1-9]|[1-9][0-9])(Z|(\+|-)((0[0-9]|1[0-3]):[0-5][0-9]|14:00))?

pattern: --(0[1-9]|1[0-9]|20)(Z|(\+|-)((0[0-9]|1[0-3]):[0-5][0-9]|14:00))?